Peptide,PTM,ModifiedAA,ModifiedPosition,PeptideUniqueToGene,ExperimentDesc,ExpID,PubmedID,ScoreType,IdentScore,LocProb,Log2FChange,PQ-val,QuantSig,PEP,MassErrorPPM
ATQTVEDSSR,nt,A,2,true,"N-term acetylation drought responses",5,26184543,,,,,,,,
ATQTVEDSSR,nt,A,2,true,"Tic56 chloroplast import - wild-type",89a,25588737,XCorr,3.1790121,,,,,,
ATQTVEDSSR,nt,A,2,true,"N-terminal ChaFRADIC",92,26010716,"MASCOT Score",67.0000000,,,,,9.4299997499547E-7,
ATQTVEDSSR,nt,A,2,true,"Arg/N-end rule seed, prt6 vs. Wt",99,29168982,"MASCOT Score",51.0700000,,0.9556656,0.0086357,NO,0.0037310000043362,-2.3140290
ATQTVEDSSR,nta,A,2,true,"Characterization plant N-terminal acetylation",6,22223895,"MASCOT Score",60.7700000,,,,,,
ATQTVEDSSR,nta,A,2,true,"N-terminal ChaFRADIC",92,26010716,"MASCOT Score",34.2200000,,,,,0.0069860001094639,
ATQTVEDSSRSGPR,ph,T,3,true,"STN8 phosphoproteome",38,21768351,"MASCOT Score",49.5100000,,,,,,1.3728500
ATQTVEDSSRSGPR,ph,T,3,true,"Phosphoproteome ethylene-regulated time response",46,24043427,"MASCOT Score",79.2900000,,,,,,13.4272000
ATQTVEDSSRSGPR,ph,T,3,true,"Chloroplast kinase substrates",60,19376835,"MASCOT Score",42.5300000,,,,,,0.0947964
ATQTVEDSSR,ph,T,3,true,"STN8 phosphoproteome",38,21768351,"MASCOT Score",91.7500000,,,,,,-0.5656790
ATQTVEDSSR,ph,T,3,true,"Phosphoproteome ethylene-regulated time response",46,24043427,"MASCOT Score",61.0100000,,,,,,-6.2512000
ATQTVEDSSR,ph,T,3,true,"Chloroplast kinase substrates",60,19376835,"MASCOT Score",82.8600000,,,,,,0.0132974
ATQTVEDSSR,ph,T,3,true,"atm and atr DNA damage response",88,25561503,"MASCOT Score",76.0000000,1.0000000,,,,,0.7200000
ATQTVEDSSR,ph,T,3,true,"Protein sumoylation and phosphorylation cross-talk",97,28419593,,,,,,,,
ATQTVEDSSR,ph,T,3,true,"Tissue atlas Arabidopsis - ProteomicsDB",114,32188942,"MaxQuant score",134.3000000,1.0000000,,,,1.7580099665793E-5,
ATQTVEDSSRSGPR,ph,T,5,true,"Phosphoproteome ethylene-regulated time response",46,24043427,"MASCOT Score",79.2900000,,,,,,13.4272000
ATQTVEDSSRSGPR,ph,T,5,true,"Chloroplast kinase substrates",60,19376835,"MASCOT Score",37.8000000,,,,,,-1.0694600
ATQTVEDSSR,ph,T,5,true,"STN8 phosphoproteome",38,21768351,"MASCOT Score",53.6900000,,,,,,-2.1152900
ATQTVEDSSR,ph,T,5,true,"Phosphoproteome ethylene-regulated time response",46,24043427,"MASCOT Score",61.0100000,,,,,,-6.2512000
ATQTVEDSSR,ph,T,5,true,"Chloroplast kinase substrates",60,19376835,"MASCOT Score",50.3000000,,,,,,-0.0425544
ATQTVEDSSR,ph,T,5,true,"atm and atr DNA damage response",88,25561503,"MASCOT Score",76.0000000,1.0000000,,,,,0.7200000
ATQTVEDSSR,ph,T,5,true,"Protein sumoylation and phosphorylation cross-talk",97,28419593,,,,,,,,
ATQTVEDSSR,ph,T,5,true,"Tissue atlas Arabidopsis - ProteomicsDB",114,32188942,"MaxQuant score",183.3700000,1.0000000,,,,2.244110008931E-9,
ATQTVEDSSRSGPR,ph,S,9,true,"atm and atr DNA damage response",88,25561503,"MASCOT Score",33.0000000,0.8950000,,,,,0.2900000
ATQTVEDSSR,ph,S,9,true,"atm and atr DNA damage response",88,25561503,"MASCOT Score",28.0000000,0.9870000,,,,,2.0300000
ATQTVEDSSR,ph,S,10,true,"atm and atr DNA damage response",88,25561503,"MASCOT Score",45.0000000,0.9920000,,,,,1.2400000
ATQTVEDSSRSGPR,ph,S,12,true,"atm and atr DNA damage response",88,25561503,"MASCOT Score",33.0000000,0.8970000,,,,,0.2900000
STTVGKLLKPLNSEYGK,ac,K,21,true,"Histone deacetylases - hda14 vs WT (thylakoids)",98d,29061669,"MaxQuant Score",102.1000000,0.9980000,-3.7920000,0.0792501,NO,1.3900000074563E-11,
STTVGKLLKPLNSEYGK,ac,K,21,true,"Quantitative Acetylproteomics",101,29440448,,,,,,,,
STTVGKLLK,ac,K,21,true,"Histone deacetylases - apicidin vs control",98a,29061669,"MaxQuant Score",155.1000000,1.0000000,-0.0010000,0.9931160,NO,1.0999999739206E-12,
LLKPLNSEYGK,ac,K,24,true,"Histone deacetylases - apicidin vs control",98a,29061669,"MaxQuant Score",132.3000000,1.0000000,0.1560000,0.5223962,NO,2.6000000730164E-7,
LLKPLNSEYGK,ac,K,24,true,"Histone deacetylases substrates - TSA vs control",98b,29061669,"MaxQuant Score",132.3000000,1.0000000,0.0430000,0.9977001,NO,2.6000000730164E-7,
LLKPLNSEYGK,ac,K,24,true,"Histone deacetylases- hda14 vs WT (low light)",98c,29061669,"MaxQuant Score",153.3400000,1.0000000,0.3370000,0.9885531,NO,7.3000002885237E-5,
LLKPLNSEYGK,ac,K,24,true,"Histone deacetylases - hda14 vs WT (thylakoids)",98d,29061669,"MaxQuant Score",137.0000000,1.0000000,0.0590000,0.9862795,NO,2.5900000764523E-5,
LLKPLNSEYGK,ph,S,28,true,"atm and atr DNA damage response",88,25561503,"MASCOT Score",42.0000000,0.9980000,,,,,-1.4400000
LLKPLNSEYGK,ac,K,32,true,"Quantitative Acetylproteomics",101,29440448,,,,,,,,
