Peptide,PTM,ModifiedAA,ModifiedPosition,PeptideUniqueToGene,ExperimentDesc,ExpID,PubmedID,ScoreType,IdentScore,LocProb,Log2FChange,PQ-val,QuantSig,PEP,MassErrorPPM
GKKQHSKDRMF,nt,G,2,true,"Arabidopsis translation initiation landscape - NT",167b,35069635,,,,,,,,
KMNSDPAYNINVSGDIK,me2,K,188,true,"Arabidopsis protein methylome",123,31809900,"MaxQuant Score",130.7700000,1.0000000,,,,4.1445298431592E-36,0.5854700
AAAIAAILESR,ph,S,242,true,"Tissue atlas Arabidopsis - ProteomicsDB",114,32188942,"MaxQuant score",88.0750000,1.0000000,,,,0.00053486501565203,
IAMHMAGDRTPVNSK,ph,T,298,true,"Tissue atlas Arabidopsis - ProteomicsDB",114,32188942,"MaxQuant score",130.5600000,0.9999650,,,,1.4556700307367E-6,
SFTSSAFTPVTK,ph,S,317,true,"atm and atr DNA damage response",88,25561503,"MASCOT Score",74.0000000,1.0000000,,,,,-1.1900000
SFTSSAFTPVTK,ph,S,317,true,"TOR Kinase and ABA Receptor",100,29290610,XCorr,2.5138757,0.9922000,,,,0.00035739998565987,
SFTSSAFTPVTK,ph,S,317,true,"Phospho cell culture sucrose/TOR",109,30833711,,,0.9406800,,,,,
SFTSSAFTPVTK,ph,S,317,true,"Tissue atlas Arabidopsis - ProteomicsDB",114,32188942,"MaxQuant score",205.0200000,0.9971180,,,,8.874240376674E-31,
SFTSSAFTPVTK,ph,T,319,true,"Tissue atlas Arabidopsis - ProteomicsDB",114,32188942,"MaxQuant score",196.5800000,0.8355350,,,,3.7997698254809E-24,
IGSWYSNPGSGTTEAGAGGGGVGK,ph,S,535,true,"Tissue atlas Arabidopsis - ProteomicsDB",114,32188942,"MaxQuant score",188.5100000,0.8490090,,,,0,
