Peptide,PTM,ModifiedAA,ModifiedPosition,PeptideUniqueToGene,ExperimentDesc,ExpID,PubmedID,ScoreType,IdentScore,LocProb,Log2FChange,PQ-val,QuantSig,PEP,MassErrorPPM
SAKKKDLLSS,nt,S,2,true,"N-term acetylation drought responses",5,26184543,,,,,,,,
SAKKKDLLSS,nta,S,2,true,"N-term acetylation drought responses",5,26184543,,,,,,,,
SEKLLPIAER,ub,K,148,true,"upl3 mutant / wildtype",168,35926874,"MaxQuant score",74.6110000,1.0000000,-0.1171613,0.7923400,NO,0.0044342498295009,0.2424400
EACAHAAQNDR,sno,C,450,true,"Site-specific nitrosomeproteomic id - gsnor1-3",90a,25699590,XCorr,2.2900000,,,,,0.2483000010252,-7.1700000
LRGEVTNDSDSPAPPPPQPAAVLPPK,ph,S,485,true,"TOR Kinase and ABA Receptor",100,29290610,XCorr,4.0294991,0.9709000,,,,0.0012489999644458,
LSSYTDELSK,ph,S,503,true,"atm and atr DNA damage response",88,25561503,"MASCOT Score",47.0000000,0.9110000,,,,,-0.5500000
TSSSTISTNPSSPISTASTGKPPLPR,ph,T,547,true,"Large-scale phosphorylation discovery",44,23111157,XCorr,4.1390000,,,,,,
KTSSSTISTNPSSPISTASTGKPPLPR,ph,S,550,true,"Large-scale phosphorylation discovery",44,23111157,XCorr,5.1680000,,,,,,
TSSSTISTNPSSPISTASTGKPPLPR,ph,S,550,true,"Large-scale phosphorylation discovery",44,23111157,XCorr,5.6760000,,,,,,
TSSSTISTNPSSPISTASTGKPPLPR,ph,S,551,true,"Large-scale phosphorylation discovery",44,23111157,XCorr,4.8370000,,,,,,
TSSSTISTNPSSPISTASTGKPPLPR,ph,S,551,true,"Tissue atlas Arabidopsis - ProteomicsDB",114,32188942,"MaxQuant score",257.9400000,0.9739400,,,,0,
TSSSTISTNPSSPISTASTGKPPLPR,ph,S,557,true,"Tissue atlas Arabidopsis - ProteomicsDB",114,32188942,"MaxQuant score",177.9900000,0.7916710,,,,0,
KSFINSVSK,ph,S,567,true,"atm and atr DNA damage response",88,25561503,"MASCOT Score",27.0000000,1.0000000,,,,,-3.2400000
KSFINSVSK,ph,S,567,true,"Tissue atlas Arabidopsis - ProteomicsDB",114,32188942,"MaxQuant score",140.6200000,1.0000000,,,,6.4652900618967E-5,
SFINSVSK,ph,S,571,true,"TOR Kinase and ABA Receptor",100,29290610,XCorr,2.9496641,0.9975000,,,,0.080210000276566,
KSFINSVSK,ph,S,573,true,"atm and atr DNA damage response",88,25561503,"MASCOT Score",30.0000000,0.9540000,,,,,-2.2800000
SFINSVSKK,ph,S,573,true,"atm and atr DNA damage response",88,25561503,"MASCOT Score",36.0000000,0.9350000,,,,,-3.1100000
SFINSVSKK,ph,S,573,true,"Tissue atlas Arabidopsis - ProteomicsDB",114,32188942,"MaxQuant score",112.9400000,0.9843670,,,,0.00034498798777349,
SFINSVSK,ph,S,573,true,"atm and atr DNA damage response",88,25561503,"MASCOT Score",31.0000000,0.9440000,,,,,-1.0400000
LNPFSITPYNGR,ph,T,585,true,"atm and atr DNA damage response",88,25561503,"MASCOT Score",55.0000000,0.9630000,,,,,-0.3700000
LNPFSITPYNGR,ph,T,585,true,"Tissue atlas Arabidopsis - ProteomicsDB",114,32188942,"MaxQuant score",193.0000000,0.9998870,,,,6.6495097296387E-24,
