Peptide,PTM,ModifiedAA,ModifiedPosition,PeptideUniqueToGene,ExperimentDesc,ExpID,PubmedID,ScoreType,IdentScore,LocProb,Log2FChange,PQ-val,QuantSig,PEP,MassErrorPPM
ATNIGMMDSAYFVGR,nta,A,2,false,"Arabidopsis translation initiation landscape - NTA",167a,35069635,,,,,,,,
YCDSVNGGQHNYHALER,so,C,114,true,"Arabidopsis S-sulfenylation chemoproteomics",108,31578252,"pFind PSM Score",0.2700350,,,,,,-0.4804742
RILYAADGEDVGAAETQTLSPIAEGSEERR,ph,Y,255,true,"SnRK2 protein kinase substrates",85,23776212,XCorr,2.4809525,0.8230000,,,,0.10334400087595,
RILYAADGEDVGAAETQTLSPIAEGSEERR,ph,T,267,true,"SnRK2 protein kinase substrates",85,23776212,XCorr,2.4809525,0.8230000,,,,0.10334400087595,
RILYAADGEDVGAAETQTLSPIAEGSEERR,ph,T,269,true,"SnRK2 protein kinase substrates",85,23776212,XCorr,2.4809525,0.8230000,,,,0.10334400087595,
RILYAADGEDVGAAETQTLSPIAEGSEERR,ph,S,271,true,"SnRK2 protein kinase substrates",85,23776212,XCorr,2.4809525,0.8230000,,,,0.10334400087595,
RILYAADGEDVGAAETQTLSPIAEGSEER,ph,S,271,true,"TOR Kinase and ABA Receptor",100,29290610,XCorr,4.3365002,0.9966000,,,,1.3559999842983E-6,
ILYAADGEDVGAAETQTLSPIAEGSEERR,ph,S,271,true,"Col-0 callus - FC Col-0 vs. Col-0 Xray",111a,31410901,,38.3800000,,1.6587088,0.0224869,YES,,1.0174525
ILYAADGEDVGAAETQTLSPIAEGSEERR,ph,S,271,true,"Col-0 X-ray callus - FC Col-0 vs. Col-0 Xray",111b,31410901,,38.3800000,,1.6587088,0.0224869,YES,,1.0174525
ILYAADGEDVGAAETQTLSPIAEGSEERR,ph,S,271,true,"atm callus - FC atm vs. atm Xray",111c,31410901,,38.3800000,,0.6391940,0.1499728,NO,,1.0174525
ILYAADGEDVGAAETQTLSPIAEGSEERR,ph,S,271,true,"atm-3 X-ray callus - FC atm vs. atm Xray",111d,31410901,,38.3800000,,0.6391940,0.1499728,NO,,1.0174525
ILYAADGEDVGAAETQTLSPIAEGSEER,ph,S,271,true,"Phospho cell culture sucrose/TOR",109,30833711,,,0.8832860,,,,,
ILYAADGEDVGAAETQTLSPIAEGSEER,ph,S,271,true,"Tissue atlas Arabidopsis - ProteomicsDB",114,32188942,"MaxQuant score",215.5700000,0.9997960,,,,0,
ILYAADGEDVGAAETQTLSPIAEGSEERR,ph,S,277,true,"Tissue atlas Arabidopsis - ProteomicsDB",114,32188942,"MaxQuant score",134.9600000,0.9999540,,,,0,
RNSVTESQK,ph,S,283,true,"atm and atr DNA damage response",88,25561503,"MASCOT Score",29.0000000,0.9960000,,,,,-1.2000000
QRLSDASDVK,ph,S,313,true,"Tissue atlas Arabidopsis - ProteomicsDB",114,32188942,"MaxQuant score",134.0100000,1.0000000,,,,3.7008001527283E-5,
QRLSDASDVK,ph,S,316,true,"Tissue atlas Arabidopsis - ProteomicsDB",114,32188942,"MaxQuant score",90.0050000,1.0000000,,,,0.0010005800286308,
CSGSSPLLTC,ph,S,324,true,"atm and atr DNA damage response",88,25561503,"MASCOT Score",27.0000000,0.9200000,,,,,0.2100000
