Peptide,PTM,ModifiedAA,ModifiedPosition,PeptideUniqueToGene,ExperimentDesc,ExpID,PubmedID,ScoreType,IdentScore,LocProb,Log2FChange,PQ-val,QuantSig,PEP,MassErrorPPM
FKQETPDKETPEQR,sumo,K,91,true,"SUMO Ligase SIZ1 heat stress",4,29588388,,,,,,,,
PVIDYKTDITGVTAEDLER,ub,K,190,true,"Arabidopsis ubiquitination by TUBEs",2,23667124,,,,,,,,
PVIDYKTDITGVTAEDLER,ub,K,190,true,"MudPIT plant ubiquitination",103,17272265,XCorr,2.2500000,,,,,,
RPSLNNLCK,ph,S,263,false,"atm and atr DNA damage response",88,25561503,"MASCOT Score",41.0000000,1.0000000,,,,,0.0300000
RPSLNNLCK,ph,S,263,false,"Tissue atlas Arabidopsis - ProteomicsDB",114,32188942,"MaxQuant score",64.1210000,1.0000000,,,,0.013291300274432,
EMEELKEK,ub,K,726,true,"Arabidopsis ubiquitination by TUBEs",2,23667124,,,,,,,,
EMEELKEK,ub,K,726,true,"MudPIT plant ubiquitination",103,17272265,XCorr,2.1400000,,,,,,
AMEFAISCEGHSKEIEELK,me2,K,743,true,"Arabidopsis protein methylome",123,31809900,"MaxQuant Score",163.1800000,1.0000000,,,,0,-0.9451400
