Peptide,PTM,ModifiedAA,ModifiedPosition,PeptideUniqueToGene,ExperimentDesc,ExpID,PubmedID,ScoreType,IdentScore,LocProb,Log2FChange,PQ-val,QuantSig,PEP,MassErrorPPM
SNPGLCGEIINR,ox,C,227,false,"OxiTRAQ Arabidopsis - 5 mM H2O2 versus control",47,24376095,,,,-0.1351150,0.0984872,NO,,
SNPGLCGEIINR,sno,C,227,false,"hot5-4 / wildtype, FAT-switch S-nitrosoproteome",169,37277371,,,,,,,,
SPFFGSTNK,ng,N,246,true,"Conserved N-glycosylation",74,22633491,"MaxQuant Score",97.8920000,1.0000000,,,,0.0020000000949949,0.0890000
GEASLSQQQQSQNQTPR,ph,S,326,true,"atm and atr DNA damage response",88,25561503,"MASCOT Score",42.0000000,0.9940000,,,,,-0.1600000
GEASLSQQQQSQNQTPR,ph,S,326,true,"Tissue atlas Arabidopsis - ProteomicsDB",114,32188942,"MaxQuant score",56.8510000,0.7717260,,,,0.0016648600576445,
GEASLSQQQQSQNQTPR,ph,S,328,true,"TOR Kinase and ABA Receptor",100,29290610,XCorr,4.7221484,0.9857000,,,,1.6019999748096E-5,
GEASLSQQQQSQNQTPR,ph,S,328,true,"Tissue atlas Arabidopsis - ProteomicsDB",114,32188942,"MaxQuant score",394.0100000,0.9999990,,,,0,
GEASLSQQQQSQNQTPR,ph,S,333,true,"atm and atr DNA damage response",88,25561503,"MASCOT Score",57.0000000,1.0000000,,,,,0.0300000
GEASLSQQQQSQNQTPR,ph,S,333,true,"Tissue atlas Arabidopsis - ProteomicsDB",114,32188942,"MaxQuant score",273.5500000,0.9999150,,,,0,
GEASLSQQQQSQNQTPR,ph,T,337,true,"atm and atr DNA damage response",88,25561503,"MASCOT Score",57.0000000,1.0000000,,,,,0.0300000
GEASLSQQQQSQNQTPR,ph,T,337,true,"Tissue atlas Arabidopsis - ProteomicsDB",114,32188942,"MaxQuant score",472.7800000,1.0000000,,,,0,
AVPVLNSDTESQKR,ph,S,348,true,"atm and atr DNA damage response",88,25561503,"MASCOT Score",35.0000000,1.0000000,,,,,-0.3700000
AVPVLNSDTESQKR,ph,S,348,true,"Tissue atlas Arabidopsis - ProteomicsDB",114,32188942,"MaxQuant score",92.6610000,0.9806250,,,,0.00014738900063094,
AVPVLNSDTESQK,ph,S,348,true,"TOR Kinase and ABA Receptor",100,29290610,XCorr,2.1044006,0.8940000,,,,0.11580000072718,
AVPVLNSDTESQKR,ph,S,352,true,"atm and atr DNA damage response",88,25561503,"MASCOT Score",35.0000000,1.0000000,,,,,-0.3700000
AVPVLNSDTESQKR,ph,S,352,true,"Tissue atlas Arabidopsis - ProteomicsDB",114,32188942,"MaxQuant score",102.5000000,0.9944530,,,,2.3047799913911E-5,
IPNSGNLVFCGESR,ph,S,371,true,"Phosphorylation Early Elicitor Signaling",23,17317660,,,,,,,,
IPNSGNLVFCGESR,ph,S,371,true,"atm and atr DNA damage response",88,25561503,"MASCOT Score",57.0000000,1.0000000,,,,,-1.7100000
IPNSGNLVFCGESR,ph,S,371,true,"Tissue atlas Arabidopsis - ProteomicsDB",114,32188942,"MaxQuant score",246.4900000,1.0000000,,,,0,
SQGMYTMEQLMR,ph,S,382,true,"Plasmamembrane phosphorylation",20,15308754,,,,,,,,
SQGMYTMEQLMR,ph,S,382,true,"Tyrosine phosphorylation in Arabidopsis",59,18463617,"MASCOT Score",37.0000000,,,,,,-1.8022601
SQGMYTMEQLMR,ph,S,382,true,"atm and atr DNA damage response",88,25561503,"MASCOT Score",47.0000000,1.0000000,,,,,-0.5300000
SQGMYTMEQLMR,ph,S,382,true,"Phospho cell culture sucrose/TOR",109,30833711,,,0.9999940,,,,,
SQGMYTMEQLMR,ph,S,382,true,"Tissue atlas Arabidopsis - ProteomicsDB",114,32188942,"MaxQuant score",181.6700000,1.0000000,,,,6.5648497843978E-20,
ASAELLGR,ph,S,395,false,"Plasmamembrane phosphorylation",20,15308754,,,,,,,,
ASAELLGR,ph,S,395,false,"Phosphorylation Early Elicitor Signaling",23,17317660,,,,,,,,
ASAELLGR,ph,S,395,false,"Plasmembrane Ph Immune Responses",25,17651370,,,,,,,,
ASAELLGR,ph,S,395,false,"Tyrosine phosphorylation in Arabidopsis",59,18463617,"MASCOT Score",29.0000000,,,,,,-0.8934398
ASAELLGR,ph,S,395,false,"atm and atr DNA damage response",88,25561503,"MASCOT Score",43.0000000,1.0000000,,,,,-0.3800000
ASAELLGR,ph,S,395,false,"Tissue atlas Arabidopsis - ProteomicsDB",114,32188942,"MaxQuant score",107.2100000,1.0000000,,,,0.0039491001516581,
