Peptide,PTM,ModifiedAA,ModifiedPosition,PeptideUniqueToGene,ExperimentDesc,ExpID,PubmedID,ScoreType,IdentScore,LocProb,Log2FChange,PQ-val,QuantSig,PEP,MassErrorPPM
EALEQASEDGLLVK,ph,S,53,true,"Tissue atlas Arabidopsis - ProteomicsDB",114,32188942,"MaxQuant score",248.2400000,1.0000000,,,,0,
SQDMEEEDESQDQILGR,ph,S,61,true,"Tissue atlas Arabidopsis - ProteomicsDB",114,32188942,"MaxQuant score",111.3300000,1.0000000,,,,2.0342099116277E-9,
SQDMEEEDESQDQILGR,ph,S,70,true,"Tissue atlas Arabidopsis - ProteomicsDB",114,32188942,"MaxQuant score",271.3100000,1.0000000,,,,0,
ATSLAAQR,ph,S,95,true,"atm and atr DNA damage response",88,25561503,"MASCOT Score",46.0000000,0.9980000,,,,,-0.2600000
ATSLAAQR,ph,S,95,true,"Tissue atlas Arabidopsis - ProteomicsDB",114,32188942,"MaxQuant score",173.3900000,0.9999340,,,,0.0002991970104631,
QKSPLLVRK,ph,S,519,true,"TOR Kinase and ABA Receptor",100,29290610,XCorr,2.0914178,1.0000000,,,,0.0045730001293123,
QKSPLLVR,ph,S,519,true,"atm and atr DNA damage response",88,25561503,"MASCOT Score",33.0000000,1.0000000,,,,,0.9300000
QKSPLLVR,ph,S,519,true,"Tissue atlas Arabidopsis - ProteomicsDB",114,32188942,"MaxQuant score",152.3700000,1.0000000,,,,0.00309297000058,
SPLLVR,ph,S,519,false,"TOR Kinase and ABA Receptor",100,29290610,XCorr,2.0737357,1.0000000,,,,0.028119999915361,
SSPKPASK,ph,S,532,true,"atm and atr DNA damage response",88,25561503,"MASCOT Score",35.0000000,1.0000000,,,,,-1.6800000
VTEIEEEEEEGGSSK,ph,S,598,true,"atm and atr DNA damage response",88,25561503,"MASCOT Score",57.0000000,0.9980000,,,,,-0.7500000
LTAHANGSSSGIK,ph,S,608,true,"atm and atr DNA damage response",88,25561503,"MASCOT Score",36.0000000,0.8850000,,,,,-1.4200000
LTAHANGSSSGIK,ph,S,608,true,"Tissue atlas Arabidopsis - ProteomicsDB",114,32188942,"MaxQuant score",154.0200000,0.8800950,,,,1.9511800175565E-8,
LTAHANGSSSGIKDSAIRR,ph,S,610,true,"Tissue atlas Arabidopsis - ProteomicsDB",114,32188942,"MaxQuant score",113.4300000,0.7829390,,,,5.7640602335596E-7,
EKSQYNGGRLLVNEDEHPSK,ph,S,634,true,"Brassinosteroid-Regulated Phosphorylation Dynamics",94,26187819,"MaxQuant Score",71.4180000,1.0000000,,,,0.043999999761581,0.6000000
EKSQYNGGRLLVNEDEHPSK,ph,Y,636,true,"Brassinosteroid-Regulated Phosphorylation Dynamics",94,26187819,"MaxQuant Score",71.4180000,1.0000000,,,,0.043999999761581,0.6000000
EKSQYNGGRLLVNEDEHPSK,ph,S,650,true,"Brassinosteroid-Regulated Phosphorylation Dynamics",94,26187819,"MaxQuant Score",71.4180000,1.0000000,,,,0.043999999761581,0.6000000
LLVNEDEHPSKRR,ph,S,650,true,"Tissue atlas Arabidopsis - ProteomicsDB",114,32188942,"MaxQuant score",200.9600000,1.0000000,,,,8.8216897546427E-26,
LLVNEDEHPSKR,ph,S,650,true,"Phosphorylation Early Elicitor Signaling",23,17317660,,,,,,,,
LLVNEDEHPSKR,ph,S,650,true,"atm and atr DNA damage response",88,25561503,"MASCOT Score",71.0000000,1.0000000,,,,,-2.2400000
LLVNEDEHPSKR,ph,S,650,true,"Phospho cell culture sucrose/TOR",109,30833711,,,1.0000000,,,,,
LLVNEDEHPSK,ph,S,650,true,"STN8 phosphoproteome",38,21768351,"MASCOT Score",44.2000000,,,,,,-0.9741200
LLVNEDEHPSK,ph,S,650,true,"srk2dei ABA signaling phopshoproteomics",83,23572148,"MASCOT Score",35.0000000,,,,,,-0.0004000
LLVNEDEHPSK,ph,S,650,true,"atm and atr DNA damage response",88,25561503,"MASCOT Score",27.0000000,1.0000000,,,,,-1.4700000
LLVNEDEHPSK,ph,S,650,true,"TOR Kinase and ABA Receptor",100,29290610,XCorr,3.2419071,1.0000000,,,,0.0011309999972582,
LLVNEDEHPSK,ph,S,650,true,"Lateral root-induction - NAA vs control",106,23328941,"MASCOT Score",26.0000000,,,,,,
SDSDGEHKNLVQIYGPK,ph,S,734,true,"Tissue atlas Arabidopsis - ProteomicsDB",114,32188942,"MaxQuant score",45.8850000,0.9756350,,,,0.0021242299117148,
SEDSSSWKPVDR,ph,S,805,true,"Tissue atlas Arabidopsis - ProteomicsDB",114,32188942,"MaxQuant score",105.1400000,0.7844260,,,,0.00013734400272369,
QGTLPTVIEEDDSSET,ph,S,867,true,"LAXIC - ABA stress",84a,23660473,XCorr,3.4400000,0.9790000,,,,4.6699999074917E-5,
QGTLPTVIEEDDSSET,ph,S,867,true,"SnRK2 protein kinase substrates",85,23776212,XCorr,2.3724663,0.8050000,,,,0.0029258199501783,
QGTLPTVIEEDDSSET,ph,S,868,true,"atm and atr DNA damage response",88,25561503,"MASCOT Score",78.0000000,0.9160000,,,,,-0.3200000
QGTLPTVIEEDDSSET,ph,T,870,true,"atm and atr DNA damage response",88,25561503,"MASCOT Score",76.0000000,0.9560000,,,,,-0.3800000
QGTLPTVIEEDDSSET,ph,T,870,true,"Tissue atlas Arabidopsis - ProteomicsDB",114,32188942,"MaxQuant score",131.8600000,0.9418230,,,,7.6728397857551E-8,
