Peptide,PTM,ModifiedAA,ModifiedPosition,PeptideUniqueToGene,ExperimentDesc,ExpID,PubmedID,ScoreType,IdentScore,LocProb,Log2FChange,PQ-val,QuantSig,PEP,MassErrorPPM
DIGSGNFGVAR,ph,S,30,false,"Tyrosine phosphorylation in Arabidopsis",59,18463617,"MASCOT Score",49.0000000,,,,,,0.0853605
DIGSGNFGVAR,ph,S,30,false,"atm and atr DNA damage response",88,25561503,"MASCOT Score",49.0000000,1.0000000,,,,,1.6000000
DIGSGNFGVAR,ph,S,30,false,"TOR Kinase and ABA Receptor",100,29290610,XCorr,3.0261509,1.0000000,,,,0.0003877000126522,
DIGSGNFGVAR,ph,S,30,false,"Tissue atlas Arabidopsis - ProteomicsDB",114,32188942,"MaxQuant score",94.1910000,1.0000000,,,,0.00017425499390811,
DLKLENTLLDGSPAPR,ph,S,152,false,"Tissue atlas Arabidopsis - ProteomicsDB",114,32188942,"MaxQuant score",89.3530000,1.0000000,,,,3.5572298656916E-5,
ICDFGYSK,ox,C,160,false,"OxiTRAQ Arabidopsis - 5 mM H2O2 versus control",47,24376095,,,,0.1234167,0.3284713,NO,,
ICDFGYSK,sno,C,160,false,"hot5-4 / wildtype, FAT-switch S-nitrosoproteome",169,37277371,,,,0.6346391,0.0089187,YES,,
SSVLHSQPKSTVGTPAYIAPEVLLR,ph,S,172,true,"PP2Cs regulate ABA-induced kinases",33,19805022,"MASCOT Score",30.0000000,,,,,,-0.7121710
SSVLHSQPK,ph,S,172,false,"Ph protein kinases and peptide chip analysis",27,18433157,,,,,,,,
SSVLHSQPK,ph,S,172,false,"PP2Cs regulate ABA-induced kinases",33,19805022,"MASCOT Score",48.0000000,,,,,,0.2140260
SSVLHSQPK,ph,S,172,false,"srk2dei ABA signaling phopshoproteomics",83,23572148,"MASCOT Score",23.0000000,,,,,,0.0005000
SSVLHSQPK,ph,S,172,false,"SnRK2 protein kinase substrates",85,23776212,XCorr,3.1456251,1.0000000,,,,0.0070161600597203,
SSVLHSQPK,ph,S,172,false,"atm and atr DNA damage response",88,25561503,"MASCOT Score",46.0000000,1.0000000,,,,,-0.9300000
SSVLHSQPK,ph,S,172,false,"TOR Kinase and ABA Receptor",100,29290610,XCorr,3.1178513,1.0000000,,,,0.00084799999604002,
SSVLHSQPK,ph,S,172,false,"Phospho cell culture sucrose/TOR",109,30833711,,,1.0000000,,,,,
SSVLHSQPK,ph,S,172,false,"Tissue atlas Arabidopsis - ProteomicsDB",114,32188942,"MaxQuant score",202.0500000,1.0000000,,,,1.025900047693E-15,
SSVLHSQPKSTVGTPAYIAPEVLLR,ph,S,176,true,"PP2Cs regulate ABA-induced kinases",33,19805022,"MASCOT Score",43.0000000,,,,,,-0.2854900
STVGTPAYIAPEVLLRQEYDGK,ph,S,176,true,"ABA-induced protein phosphorylation",35,20733066,,,,,,,,
STVGTPAYIAPEVLLR,ph,T,177,true,"PP2Cs regulate ABA-induced kinases",33,19805022,"MASCOT Score",42.0000000,,,,,,-0.8424510
STVGTPAYIAPEVLLR,ph,T,177,true,"srk2dei ABA signaling phopshoproteomics",83,23572148,"MASCOT Score",35.0000000,,,,,,0.0001000
STVGTPAYIAPEVLLR,ph,T,180,true,"SnRK2 protein kinase substrates",85,23776212,XCorr,3.1000476,0.8960000,,,,9.454439453549E-10,
ISPECCHLISR,so,C,251,true,"Arabidopsis S-sulfenylation chemoproteomics",108,31578252,"pFind PSM Score",0.0562577,,1.3611100,,,,-2.1469117
