Peptide,PTM,ModifiedAA,ModifiedPosition,PeptideUniqueToGene,ExperimentDesc,ExpID,PubmedID,ScoreType,IdentScore,LocProb,Log2FChange,PQ-val,QuantSig,PEP,MassErrorPPM
HLTDDDVLLGER,ph,T,63,true,"Tissue atlas Arabidopsis - ProteomicsDB",114,32188942,"MaxQuant score",179.4600000,1.0000000,,,,3.4339899066953E-19,
RASTSSSTFDSGLTR,ph,S,75,true,"atm and atr DNA damage response",88,25561503,"MASCOT Score",52.0000000,0.9400000,,,,,0.3000000
RASTSSSTFDSGLTR,ph,S,75,true,"Tissue atlas Arabidopsis - ProteomicsDB",114,32188942,"MaxQuant score",191.3200000,0.9648610,,,,3.3318400142474E-34,
ASTSSSTFDSGLTR,ph,S,77,true,"Tissue atlas Arabidopsis - ProteomicsDB",114,32188942,"MaxQuant score",127.3200000,0.8114630,,,,3.7152098229853E-5,
SPSAFTAVPR,ph,S,88,true,"Tissue atlas Arabidopsis - ProteomicsDB",114,32188942,"MaxQuant score",101.3000000,0.9803700,,,,5.8784798966371E-6,
SPSAFTAVPR,ph,S,90,true,"TOR Kinase and ABA Receptor",100,29290610,XCorr,3.3888838,0.9999000,,,,0.0032619999255985,
SPSAFTAVPR,ph,S,90,true,"Tissue atlas Arabidopsis - ProteomicsDB",114,32188942,"MaxQuant score",235.4700000,0.9999990,,,,4.2961398440763E-37,
SPSAFTAVPR,ph,S,90,true,"Touch-induced phosphorylation: 40s touch vs untouc",136,30291188,"MASCOT score",57.2800000,,0.8220827,0.0437832,YES,,5.5331596
SPSAVPLPLPLPLPEVAGIR,ph,S,98,true,"TOR Kinase and ABA Receptor",100,29290610,XCorr,4.4336290,0.9389000,,,,8.2269998813445E-8,
KATENSSYQDFSPR,ph,S,170,true,"atm and atr DNA damage response",88,25561503,"MASCOT Score",66.0000000,1.0000000,,,,,0.3800000
KATENSSYQDFSPR,ph,S,170,true,"Tissue atlas Arabidopsis - ProteomicsDB",114,32188942,"MaxQuant score",261.0600000,1.0000000,,,,0,
ATENSSYQDFSPR,ph,S,170,true,"Large-scale phosphorylation discovery",44,23111157,XCorr,4.5050000,,,,,,
STGHDLPFFYLPPK,ph,S,202,true,"TOR Kinase and ABA Receptor",100,29290610,XCorr,3.8687272,0.9238000,,,,0.00013400000170805,
SPQPSRPSSPLHSVDSSAPPR,ph,S,264,true,"Tissue atlas Arabidopsis - ProteomicsDB",114,32188942,"MaxQuant score",50.7050000,0.9946920,,,,0.00093923002714291,
SPQPSRPSSPLHSVDSSAPPR,ph,S,271,true,"LAXIC - mannitol vs control",84b,23660473,XCorr,2.0200000,0.8050000,,,,0.014447400346398,
SPQPSRPSSPLHSVDSSAPPR,ph,S,272,true,"LAXIC - mannitol vs control",84b,23660473,XCorr,2.0200000,0.8050000,,,,0.014447400346398,
DSVSSPLHPR,ph,S,288,true,"Tissue atlas Arabidopsis - ProteomicsDB",114,32188942,"MaxQuant score",75.5660000,0.9065750,,,,0.0040358500555158,
DSVSSPLHPR,ph,S,289,true,"Tissue atlas Arabidopsis - ProteomicsDB",114,32188942,"MaxQuant score",141.7100000,0.9992980,,,,2.0510799458862E-6,
LSTDVTNGR,ph,S,296,true,"atm and atr DNA damage response",88,25561503,"MASCOT Score",36.0000000,0.9970000,,,,,0.4500000
SPDLTGTVNRLSPR,ph,T,677,true,"Tissue atlas Arabidopsis - ProteomicsDB",114,32188942,"MaxQuant score",147.4900000,0.9635050,,,,1.9896600633729E-7,
SPDLTGTVNRLSPR,ph,S,682,true,"atm and atr DNA damage response",88,25561503,"MASCOT Score",37.0000000,0.9990000,,,,,-0.6000000
SPDLTGTVNRLSPR,ph,S,682,true,"Tissue atlas Arabidopsis - ProteomicsDB",114,32188942,"MaxQuant score",172.6000000,0.9999960,,,,1.8939500528907E-16,
STLEAIPSPCPSQRPK,ph,S,692,true,"Tissue atlas Arabidopsis - ProteomicsDB",114,32188942,"MaxQuant score",124.5100000,0.9918780,,,,1.5157899942256E-21,
TGVTSDHL,ph,S,713,true,"Tissue atlas Arabidopsis - ProteomicsDB",114,32188942,"MaxQuant score",111.7400000,0.9854590,,,,0.0035670900251716,
