Peptide,PTM,ModifiedAA,ModifiedPosition,PeptideUniqueToGene,ExperimentDesc,ExpID,PubmedID,ScoreType,IdentScore,LocProb,Log2FChange,PQ-val,QuantSig,PEP,MassErrorPPM
SVGPAHELSSLNGGSQESPPTTTTSLKSLR,nt,S,140,true,"HUNTER N-terminome: legumain, GluC and trypsin",119,31951383,"MaxQuant score",90.3700000,,,,,,
SVGPAHELSSLNGGSQESPPTTTTSLKSLR,nta,S,140,true,"HUNTER N-terminome: legumain, GluC and trypsin",119,31951383,"MaxQuant score",53.8950000,,,,,,
LVSGSCYLPHPEK,ox,C,175,true,"SPEAR - 10 mM H2O2 / mock",138a,34619326,,,,3.4905491,0.0284235,YES,,
LVSGSCYLPHPEK,so,C,175,true,"Arabidopsis S-sulfenylation chemoproteomics",108,31578252,"pFind PSM Score",0.0101515,,0.9309400,,,,-0.8577565
QHKGSSIDPLVVLE,nt,Q,234,true,"HUNTER N-terminome: legumain, GluC and trypsin",119,31951383,"MaxQuant score",,,,,,,
GSSTACIIVLKDK,so,C,262,true,"S-sulfenylation site detection using YAP1C",110,32714340,,,,,,,,
GSSTACIIVLK,so,C,262,true,"Arabidopsis S-sulfenylation chemoproteomics",108,31578252,"pFind PSM Score",0.0105966,,1.7773900,,,,-0.9981835
QSPFATAAQEAGYR,nt,Q,382,true,"HUNTER N-terminome: legumain, GluC and trypsin",119,31951383,"MaxQuant score",42.8090000,,,,,,
