Peptide,PTM,ModifiedAA,ModifiedPosition,PeptideUniqueToGene,ExperimentDesc,ExpID,PubmedID,ScoreType,IdentScore,LocProb,Log2FChange,PQ-val,QuantSig,PEP,MassErrorPPM
FSVDNPTDRR,nt,F,23,true,"N-terminal ChaFRADIC",92,26010716,"MASCOT Score",37.5800000,,,,,0.030710000544786,
FSVDNPTDR,nt,F,23,true,"Arg/N-end rule pathway Roots",80,25728785,"MASCOT Score",37.3300000,,,,,0.0057479999959469,
FSVDNPTDR,nt,F,23,true,"N-terminal ChaFRADIC",92,26010716,"MASCOT Score",41.1600000,,,,,0.00045049999607727,
FSVDNPTDR,nt,F,23,true,"Arg/N-end rule seed, prt6 vs. Wt",99,29168982,"MASCOT Score",37.4300000,,0.3465058,0.1646166,NO,0.038350000977516,-1.1810498
FSVDNPTDR,nt,F,23,true,"FtsH12 N-terminome: WT / FtsH12 knockdown miRNA",118,33216923,"MaxQuant score",125.6100000,,,,,1.8200000395652E-9,
FSVDNPTDR,nt,F,23,true,"Arabidopsis translation initiation landscape - NT",167b,35069635,,,,,,,,
SSHSIFFNTLKSR,ac,K,54,true,"Quantitative Acetylproteomics",101,29440448,,,,,,,,
TLSTDKK,ac,K,358,true,"Quantitative Acetylproteomics",101,29440448,,,,,,,,
