Peptide,PTM,ModifiedAA,ModifiedPosition,PeptideUniqueToGene,ExperimentDesc,ExpID,PubmedID,ScoreType,IdentScore,LocProb,Log2FChange,PQ-val,QuantSig,PEP,MassErrorPPM
SSSSMALITVIDPK,ph,S,57,true,"atm and atr DNA damage response",88,25561503,"MASCOT Score",40.0000000,0.8490000,,,,,-1.1400000
SSSSMALITVIDPK,ph,S,60,true,"atm and atr DNA damage response",88,25561503,"MASCOT Score",35.0000000,0.9990000,,,,,-0.4700000
GNISATDLQLIPGGAAK,ph,S,229,true,"Phosphorylation Early Elicitor Signaling",23,17317660,,,,,,,,
GNISATDLQLIPGGAAK,ph,S,229,true,"TOR Kinase and ABA Receptor",100,29290610,XCorr,4.1632771,0.8881000,,,,0.00022149999858811,
GNISATDLQLIPGGAAK,ph,S,229,true,"Tissue atlas Arabidopsis - ProteomicsDB",114,32188942,"MaxQuant score",251.8100000,0.9997630,,,,0,
HAIAGTLLAAQSPSTSQSTEPR,ph,S,544,true,"Tissue atlas Arabidopsis - ProteomicsDB",114,32188942,"MaxQuant score",136.3400000,0.9919520,,,,0,
NLTITEEDGDEAEGER,ph,T,563,true,"Tissue atlas Arabidopsis - ProteomicsDB",114,32188942,"MaxQuant score",69.1880000,0.9989660,,,,0.0015232400037348,
NLTITEEDGDEAEGER,ph,T,565,true,"Tissue atlas Arabidopsis - ProteomicsDB",114,32188942,"MaxQuant score",98.5720000,0.9941270,,,,2.1558600565186E-5,
EGSSPATTTDRPR,ph,S,626,true,"atm and atr DNA damage response",88,25561503,"MASCOT Score",28.0000000,0.9950000,,,,,-1.0900000
IDKEGSSPATTTDRPR,ph,S,627,true,"Tissue atlas Arabidopsis - ProteomicsDB",114,32188942,"MaxQuant score",150.6900000,0.8384200,,,,9.4318101939717E-11,
