Peptide,PTM,ModifiedAA,ModifiedPosition,PeptideUniqueToGene,ExperimentDesc,ExpID,PubmedID,ScoreType,IdentScore,LocProb,Log2FChange,PQ-val,QuantSig,PEP,MassErrorPPM
AMASSTTGVR,nta,A,28,true,"Arabidopsis translation initiation landscape - NTA",167a,35069635,,,,,,,,
ASSTTGVRVAE,nt,A,30,true,"Arabidopsis translation initiation landscape - NT",167b,35069635,,,,,,,,
SSTTGVRVAEGEGNLPKLVL,nt,S,31,true,"Arabidopsis translation initiation landscape - NT",167b,35069635,,,,,,,,
SSTTGVRVAE,nt,S,31,true,"Arg/N-end rule seed, prt6 vs. Wt",99,29168982,"MASCOT Score",33.6700000,,-0.0302687,0.7829496,NO,0.00040280001121573,0.3061897
TLNKDPDPK,ac,K,209,true,"Histone deacetylases - apicidin vs control",98a,29061669,"MaxQuant Score",52.5000000,1.0000000,-0.2020000,0.4613176,NO,0.016000000759959,
TLNKDPDPK,ac,K,209,true,"Histone deacetylases substrates - hda14 vs WT",98e,29061669,"MaxQuant Score",108.4000000,1.0000000,1.7660000,0.6652732,NO,3.7999998880878E-7,
NTNWSDAVLWNPHTQMEACYR,sno,C,275,true,"Site-specific nitrosomeproteomic id - gsnor1-3",90a,25699590,XCorr,3.2969415,,,,,1.2949999472767E-6,-6.3758899
NTNWSDAVLWNPHTQMEACYR,sno,C,275,true,"Site-specific nitrosomeproteomic id - gsnor1-3",90b,25699590,XCorr,4.3300000,,,,,5.0139999075327E-5,-4.9700000
