Peptide,PTM,ModifiedAA,ModifiedPosition,PeptideUniqueToGene,ExperimentDesc,ExpID,PubmedID,ScoreType,IdentScore,LocProb,Log2FChange,PQ-val,QuantSig,PEP,MassErrorPPM
AQVTTDTTEAPPVKVVKE,nt,A,48,true,"N-terminal ChaFRADIC",92,26010716,"MASCOT Score",22.3500000,,,,,6.7369998468791E-9,
AQVTTDTTEAPPVKVVKE,nt,A,48,true,"Stromal N-terminome",96,26371235,"MASCOT Score",66.9600000,,,,,,
QVTTDTTEAPPVKVVKE,nt,Q,49,true,"N-terminal ChaFRADIC",92,26010716,"MASCOT Score",42.9600000,,,,,2.7729998919312E-7,
QVTTDTTEAPPVKVVKE,nt,Q,49,true,"Stromal N-terminome",96,26371235,"MASCOT Score",51.2300000,,,,,,
QVTTDTTEAPPVKVVKE,nt,Q,49,true,"HUNTER N-terminome: legumain, GluC and trypsin",119,31951383,"MaxQuant score",150.5700000,,,,,,
QVTTDTTE,nt,Q,49,true,"N-terminal ChaFRADIC",92,26010716,"MASCOT Score",28.0000000,,,,,0.014259999617934,
QVTTDTTE,nt,Q,49,true,"Arg/N-end rule seed, prt6 vs. Wt",99,29168982,"MASCOT Score",59.7600000,,-0.0353789,0.8459617,NO,0.0063160001300275,-0.5454846
QVTTDTTEAPPVKVVKE,nta,Q,49,true,"N-terminal ChaFRADIC",92,26010716,"MASCOT Score",27.8300000,,,,,0.00019370000518393,
QVTTDTTEAPPVKVVKE,nta,Q,49,true,"HUNTER N-terminome: legumain, GluC and trypsin",119,31951383,"MaxQuant score",119.8700000,,,,,,
QVTTDTTEAPPVK,nta,Q,49,true,"Characterization plant N-terminal acetylation",6,22223895,"MASCOT Score",55.2300000,,,,,,
VTTDTTEAPPVKVVKE,nt,V,50,true,"HUNTER N-terminome: legumain, GluC and trypsin",119,31951383,"MaxQuant score",112.8000000,,,,,,
VTTDTTEAPPVKVVKE,nta,V,50,true,"HUNTER N-terminome: legumain, GluC and trypsin",119,31951383,"MaxQuant score",59.1850000,,,,,,
FKPKNPYTGR,ac,K,81,true,"Quantitative Acetylproteomics",101,29440448,,,,,,,,
CLLNTK,sno,C,88,false,"Cold stress nitrosylation - 4°C vs 22°C",65,24388526,,,,,,,,
CLLNTK,so,C,88,false,"S-sulfenylation site detection using YAP1C",110,32714340,,,,,,,,
TWHIVFTTE,nt,T,103,true,"N-terminal ChaFRADIC",92,26010716,"MASCOT Score",37.9300000,,,,,0.036880001425743,
NGKPHKLR,ac,K,137,true,"Quantitative Acetylproteomics",101,29440448,,,,,,,,
TVSLCVK,sno,C,160,false,"hot5-4 / wildtype, FAT-switch S-nitrosoproteome",169,37277371,,,,,,,,
TVSLCVKR,ac,K,162,false,"Histone deacetylases - hda14 vs WT (thylakoids)",98d,29061669,"MaxQuant Score",125.3000000,1.0000000,0.0970000,0.9749896,NO,0.00016799999866635,
RLVYTNDGGEIVK,ph,T,167,true,"srk2dei ABA signaling phopshoproteomics",83,23572148,"MASCOT Score",63.0000000,,,,,,0.0016000
RLVYTNDGGEIVK,ph,T,167,true,"atm and atr DNA damage response",88,25561503,"MASCOT Score",50.0000000,0.9490000,,,,,-0.5400000
LVYTNDGGEIVK,ph,T,167,true,"STN8 phosphoproteome",38,21768351,"MASCOT Score",48.8600000,,,,,,-1.5917400
LVYTNDGGEIVK,ph,T,167,true,"Phosphoproteome ethylene-regulated time response",46,24043427,"MASCOT Score",44.6100000,,,,,,9.1610000
LVYTNDGGEIVK,ph,T,167,true,"atm and atr DNA damage response",88,25561503,"MASCOT Score",74.0000000,0.9520000,,,,,-0.2200000
LVYTNDGGEIVK,ph,T,167,true,"Phospho cell culture sucrose/TOR",109,30833711,,,0.9970550,,,,,
LVYTNDGGEIVK,ph,T,167,true,"Tissue atlas Arabidopsis - ProteomicsDB",114,32188942,"MaxQuant score",143.9400000,1.0000000,,,,4.0496001929569E-6,
LVYTNDGGEIVK,ph,T,167,true,"Touch-induced phosphorylation: 40s touch vs untouc",136,30291188,"MASCOT score",65.7600000,,-0.2078489,0.1949707,NO,,4.8953179
LVYTNDGGEIVKGVCSNFLCDLKPGDEAK,ac,K,175,true,"Histone deacetylases - hda14 vs WT (thylakoids)",98d,29061669,"MaxQuant Score",106.3000000,1.0000000,-0.3920000,0.8394600,NO,2.6099999480912E-31,
GVCSNFLCDLKPGDEAK,sno,C,178,true,"hot5-4 / wildtype, FAT-switch S-nitrosoproteome",169,37277371,,,,,,,,
EMLMPK,mox,M,201,false,"cat2 Methionine oxidation - 1h stress",62a,25693801,"MASCOT Score",28.0000000,,-0.0012985,,NO,,
EMLMPK,mox,M,201,false,"cat2 Methionine oxidation - 3h stress",62b,25693801,"MASCOT Score",30.0000000,,0.0447715,,NO,,
EMLMPK,mox,M,203,false,"cat2 Methionine oxidation - 1h stress",62a,25693801,"MASCOT Score",28.0000000,,-0.0012985,,NO,,
EMLMPK,mox,M,203,false,"cat2 Methionine oxidation - 3h stress",62b,25693801,"MASCOT Score",30.0000000,,0.0447715,,NO,,
EEFEKMK,ac,K,264,true,"Quantitative Acetylproteomics",101,29440448,,,,,,,,
EQTNEKGEK,ac,K,287,true,"Histone deacetylases- hda14 vs WT (low light)",98c,29061669,"MaxQuant Score",102.5200000,1.0000000,1.1830000,0.7294575,NO,0.017000000923872,
GEKMYIQTR,ac,K,290,false,"Histone deacetylases - apicidin vs control",98a,29061669,"MaxQuant Score",164.7000000,1.0000000,0.0770000,0.6606934,NO,4.8000000544697E-18,
GEKMYIQTR,ac,K,290,false,"Histone deacetylases substrates - TSA vs control",98b,29061669,"MaxQuant Score",164.7000000,1.0000000,-0.0300000,0.9977001,NO,4.8000000544697E-18,
GEKMYIQTR,ac,K,290,false,"Histone deacetylases- hda14 vs WT (low light)",98c,29061669,"MaxQuant Score",145.4800000,1.0000000,-0.1340000,0.9885531,NO,1.4000000048142E-9,
GEKMYIQTR,ac,K,290,false,"Histone deacetylases - hda14 vs WT (thylakoids)",98d,29061669,"MaxQuant Score",108.7000000,1.0000000,0.0920000,0.9749896,NO,0.0010000000474975,
GEKMYIQTR,ac,K,290,false,"Histone deacetylases substrates - hda14 vs WT",98e,29061669,"MaxQuant Score",133.4000000,1.0000000,-0.0040000,0.9954054,NO,1.699999949839E-12,
DNTFVYMCGLK,acy,C,318,false,"Arabidopsis S-acylation atlas - Silique",163e,35681017,,,,,,,,
DNTFVYMCGLK,sno,C,318,false,"Cold stress nitrosylation - 4°C vs 22°C",65,24388526,,,,,,,,
DNTFVYMCGLKGMEK,ac,K,321,false,"Histone deacetylases- hda14 vs WT (low light)",98c,29061669,"MaxQuant Score",174.5200000,1.0000000,-2.1920000,0.8016781,NO,5.0999997410969E-13,
DNTFVYMCGLKGMEK,ac,K,321,false,"Histone deacetylases - hda14 vs WT (thylakoids)",98d,29061669,"MaxQuant Score",105.3000000,1.0000000,-0.1980000,0.8550667,NO,1.5200000147431E-9,
GMEKGIDDIMVSLAAK,ac,K,325,true,"Histone deacetylases - apicidin vs control",98a,29061669,"MaxQuant Score",65.1000000,1.0000000,0.3790000,0.2192805,NO,0.00011999999696855,
GMEKGIDDIMVSLAAK,ac,K,325,true,"Histone deacetylases - hda14 vs WT (thylakoids)",98d,29061669,"MaxQuant Score",163.2000000,1.0000000,-0.0360000,0.9954054,NO,2.3500000925284E-34,
GMEKGIDDIMVSLAAK,ac,K,325,true,"Histone deacetylases substrates - hda14 vs WT",98e,29061669,"MaxQuant Score",74.1000000,1.0000000,-0.0060000,0.9931160,NO,1.200000042445E-6,
DGIDWLEYKK,ac,K,346,true,"Histone deacetylases - hda14 vs WT (thylakoids)",98d,29061669,"MaxQuant Score",60.3000000,1.0000000,0.2610000,0.9332543,NO,0.018999999389052,
