Peptide,PTM,ModifiedAA,ModifiedPosition,PeptideUniqueToGene,ExperimentDesc,ExpID,PubmedID,ScoreType,IdentScore,LocProb,Log2FChange,PQ-val,QuantSig,PEP,MassErrorPPM
MEEYPEELR,nta,M,1,true,"Arg/N-end rule seed, prt6 vs. Wt",99,29168982,"MASCOT Score",67.3700000,,,,,0.027550000697374,-1.6006239
MEEYPEELR,nta,M,1,true,"Arabidopsis translation initiation landscape - NTA",167a,35069635,,,,,,,,
TSSFRDPLSVSDSASPIPSR,ph,S,65,true,"PAMP-triggered phosphorylation",48,24601666,"MASCOT Score",48.6800000,,,,,,
TSSFRDPLSVSDSASPIPSR,ph,S,65,true,"srk2dei ABA signaling phopshoproteomics",83,23572148,"MASCOT Score",46.0000000,,,,,,-0.0002000
TSSFRDPLSVSDSASPIPSR,ph,S,65,true,"atm and atr DNA damage response",88,25561503,"MASCOT Score",74.0000000,0.9450000,,,,,-0.0900000
TSSFRDPLSVSDSASPIPSR,ph,S,65,true,"Tissue atlas Arabidopsis - ProteomicsDB",114,32188942,"MaxQuant score",181.7100000,0.9702330,,,,5.8854535501642E-44,
TSSFRDPLSVSDSASPIPSR,ph,S,71,true,"srk2dei ABA signaling phopshoproteomics",83,23572148,"MASCOT Score",26.0000000,,,,,,0.0001000
TSSFRDPLSVSDSASPIPSR,ph,S,71,true,"LAXIC - mannitol vs control",84b,23660473,XCorr,3.0800000,0.7950000,,,,0.0023429000284523,
DPLSVSDSASPIPSR,ph,S,77,true,"Tissue atlas Arabidopsis - ProteomicsDB",114,32188942,"MaxQuant score",316.9600000,0.9999850,,,,0,
GEAITLHSITDEEYTR,ph,S,427,true,"Tissue atlas Arabidopsis - ProteomicsDB",114,32188942,"MaxQuant score",171.4700000,0.9987680,,,,7.2033401594698E-20,
EAELLSSTEGSGFK,ph,S,587,true,"Tissue atlas Arabidopsis - ProteomicsDB",114,32188942,"MaxQuant score",128.2200000,0.7697420,,,,3.701710011228E-5,
EAELLSSTEGSGFK,ph,S,591,true,"Tissue atlas Arabidopsis - ProteomicsDB",114,32188942,"MaxQuant score",226.9300000,0.9996580,,,,0,
NSQRPLWASASNTVK,ph,S,674,true,"Tissue atlas Arabidopsis - ProteomicsDB",114,32188942,"MaxQuant score",88.3850000,0.9974180,,,,0.00023244800104294,
NSQRPLWASASNTVK,ph,S,676,true,"Tissue atlas Arabidopsis - ProteomicsDB",114,32188942,"MaxQuant score",77.5050000,0.9657920,,,,0.00056217302335426,
INLVDVGGGGLFSPR,ph,S,825,true,"STN8 phosphoproteome",38,21768351,"MASCOT Score",90.0600000,,,,,,-1.5857900
INLVDVGGGGLFSPR,ph,S,825,true,"Pollen phosphoproteome Arabidopsis",43,22631563,"MASCOT Score",101.5500000,,,,,,
INLVDVGGGGLFSPR,ph,S,825,true,"SnRK2 protein kinase substrates",85,23776212,XCorr,4.0867715,1.0000000,,,,3.5788599861419E-10,
INLVDVGGGGLFSPR,ph,S,825,true,"TOR Kinase and ABA Receptor",100,29290610,XCorr,5.1463294,1.0000000,,,,6.5660001880019E-9,
INLVDVGGGGLFSPR,ph,S,825,true,"Lateral root-induction - NAA vs control",106,23328941,"MASCOT Score",24.0000000,,,,,,
INLVDVGGGGLFSPR,ph,S,825,true,"Tissue atlas Arabidopsis - ProteomicsDB",114,32188942,"MaxQuant score",233.6500000,1.0000000,,,,0,
INLVDVGGGGLFSPR,ph,S,825,true,"Touch-induced phosphorylation: 40s touch vs untouc",136,30291188,"MASCOT score",88.9900000,,2.7509840,0.0000025,YES,,3.3649309
NCSEIALK,sno,C,976,true,"hot5-4 / wildtype, FAT-switch S-nitrosoproteome",169,37277371,,,,,,,,
TPKLGLGSIHLK,ph,T,1034,true,"Conserved plant phosphoproteome - Arabidopsis",61a,20466843,"MASCOT Score",27.0000000,1.0000000,,,,,
TPKLGLGSIHLK,ph,S,1041,true,"Conserved plant phosphoproteome - Arabidopsis",61a,20466843,"MASCOT Score",27.0000000,1.0000000,,,,,
LVPLTCGEQQLPK,sno,C,1145,true,"hot5-4 / wildtype, FAT-switch S-nitrosoproteome",169,37277371,,,,-0.1229650,0.6427028,NO,,
