Peptide,PTM,ModifiedAA,ModifiedPosition,PeptideUniqueToGene,ExperimentDesc,ExpID,PubmedID,ScoreType,IdentScore,LocProb,Log2FChange,PQ-val,QuantSig,PEP,MassErrorPPM
ATSSRSERFPITPSTAATNR,ph,T,3,false,"atm and atr DNA damage response",88,25561503,"MASCOT Score",30.0000000,0.9630000,,,,,0.0200000
ATSSRSERFPITPSTAATNR,ph,S,4,false,"atm and atr DNA damage response",88,25561503,"MASCOT Score",30.0000000,0.9630000,,,,,0.0200000
SERFPITPSTAATNR,ph,T,13,false,"TOR Kinase and ABA Receptor",100,29290610,XCorr,2.3549407,0.8808000,,,,4.7180001274683E-5,
FPITPSTAATNR,ph,T,13,false,"atm and atr DNA damage response",88,25561503,"MASCOT Score",35.0000000,0.9480000,,,,,-1.1600000
FPITPSTAATNR,ph,T,13,false,"Tissue atlas Arabidopsis - ProteomicsDB",114,32188942,"MaxQuant score",125.6100000,0.9990550,,,,1.2394599480103E-6,
LTITPNSR,ph,T,25,false,"Phospho cell culture sucrose/TOR",109,30833711,,,0.9956420,,,,,
LTITPNSR,ph,T,25,false,"Tissue atlas Arabidopsis - ProteomicsDB",114,32188942,"MaxQuant score",154.8500000,0.9999850,,,,0.0042116600088775,
VLKSPLTEEIMWK,ph,S,33,false,"Tissue atlas Arabidopsis - ProteomicsDB",114,32188942,"MaxQuant score",186.9600000,0.9999880,,,,2.3123300375295E-22,
LKEVESR,me2,K,208,false,"Arabidopsis protein methylome",123,31809900,"MaxQuant Score",80.2190000,1.0000000,,,,0.010849500074983,0.3905900
KAFEDKK,me2,K,296,false,"Arabidopsis protein methylome",123,31809900,"MaxQuant Score",79.4740000,1.0000000,,,,0.0078969597816467,-0.1820600
EDLVGEKEHDLEVQSR,ub,K,405,false,"Arabidopsis ubiquitination COFRADIC",40,26744219,"MaxQuant Score",83.5400000,1.0000000,,,,7.4959996543278E-11,0.7140000
NQHKNDVESLNR,ac,K,582,false,"Quantitative Acetylproteomics",101,29440448,,,,,,,,
MQLSNLER,ph,S,759,false,"atm and atr DNA damage response",88,25561503,"MASCOT Score",40.0000000,1.0000000,,,,,0.3500000
MQLSNLER,ph,S,759,false,"Phospho cell culture sucrose/TOR",109,30833711,,,1.0000000,,,,,
MQLSNLER,ph,S,759,false,"Tissue atlas Arabidopsis - ProteomicsDB",114,32188942,"MaxQuant score",157.7800000,1.0000000,,,,0.0013349000364542,
SWEKVSALK,ph,S,764,false,"Tissue atlas Arabidopsis - ProteomicsDB",114,32188942,"MaxQuant score",88.2750000,1.0000000,,,,0.00039509701309726,
SWEKVSALK,ph,S,769,false,"Tissue atlas Arabidopsis - ProteomicsDB",114,32188942,"MaxQuant score",88.2750000,1.0000000,,,,0.0020540100522339,
VVSRDDELDLQNGVSTVSNSEDGYNSSMER,ph,S,792,false,"SnRK2 protein kinase substrates",85,23776212,XCorr,3.3416317,0.9810000,,,,2.1541700714889E-12,
VVSRDDELDLQNGVSTVSNSEDGYNSSMER,ph,S,792,false,"TOR Kinase and ABA Receptor",100,29290610,XCorr,6.8630209,0.9965000,,,,6.3929999072343E-9,
VVSRDDELDLQNGVSTVSNSEDGYNSSMER,ph,S,792,false,"Tissue atlas Arabidopsis - ProteomicsDB",114,32188942,"MaxQuant score",100.2200000,0.7564960,,,,1.146999969659E-23,
VVSRDDELDLQNGVSTVSNSEDGYNSSMER,ph,S,794,false,"Tissue atlas Arabidopsis - ProteomicsDB",114,32188942,"MaxQuant score",113.1900000,0.9143810,,,,1.0079299821013E-32,
CTNLIFKTSPEK,ph,T,829,false,"Tissue atlas Arabidopsis - ProteomicsDB",114,32188942,"MaxQuant score",226.1400000,0.8233200,,,,0,
CTNLIFKTSPEK,ph,S,830,false,"Tissue atlas Arabidopsis - ProteomicsDB",114,32188942,"MaxQuant score",257.1100000,0.9846660,,,,0,
STLMHHYEEEGGVPSEK,ph,S,848,false,"atm and atr DNA damage response",88,25561503,"MASCOT Score",44.0000000,1.0000000,,,,,0.1900000
STLMHHYEEEGGVPSEK,ph,S,848,false,"Tissue atlas Arabidopsis - ProteomicsDB",114,32188942,"MaxQuant score",163.4100000,1.0000000,,,,2.2202399489289E-17,
AYTEGLSIAVER,ph,T,864,false,"Tissue atlas Arabidopsis - ProteomicsDB",114,32188942,"MaxQuant score",99.9410000,0.9999980,,,,0.00036425300640985,
AYTEGLSIAVER,ph,S,868,false,"Tissue atlas Arabidopsis - ProteomicsDB",114,32188942,"MaxQuant score",137.8000000,1.0000000,,,,1.6085099559859E-5,
GNTSGDETSEPSNNKK,ph,T,884,false,"atm and atr DNA damage response",88,25561503,"MASCOT Score",25.0000000,0.9910000,,,,,-0.1200000
RGNTSGDETSEPSNNK,ph,T,884,false,"atm and atr DNA damage response",88,25561503,"MASCOT Score",48.0000000,0.9470000,,,,,-0.0200000
GNTSGDETSEPSNNK,ph,T,884,false,"atm and atr DNA damage response",88,25561503,"MASCOT Score",25.0000000,0.9900000,,,,,-0.4900000
GNTSGDETSEPSNNKK,ph,S,885,false,"SnRK2 protein kinase substrates",85,23776212,XCorr,2.6524122,0.8990000,,,,3.2288799189928E-8,
GNTSGDETSEPSNNK,ph,S,885,false,"SnRK2 protein kinase substrates",85,23776212,XCorr,3.4011843,0.9790000,,,,0.00087263801833615,
GNTSGDETSEPSNNK,ph,S,885,false,"atm and atr DNA damage response",88,25561503,"MASCOT Score",25.0000000,0.9900000,,,,,-0.4900000
GNTSGDETSEPSNNK,ph,S,885,false,"Tissue atlas Arabidopsis - ProteomicsDB",114,32188942,"MaxQuant score",188.9000000,0.9874430,,,,3.6152201061356E-26,
GNTSGDETSEPSNNK,ph,T,889,false,"atm and atr DNA damage response",88,25561503,"MASCOT Score",31.0000000,0.9920000,,,,,0.3900000
RGNTSGDETSEPSNNK,ph,S,890,false,"atm and atr DNA damage response",88,25561503,"MASCOT Score",37.0000000,0.9990000,,,,,-0.0200000
RGNTSGDETSEPSNNK,ph,S,890,false,"Tissue atlas Arabidopsis - ProteomicsDB",114,32188942,"MaxQuant score",130.4000000,0.9639770,,,,6.3580600340174E-8,
GNTSGDETSEPSNNK,ph,S,890,false,"atm and atr DNA damage response",88,25561503,"MASCOT Score",24.0000000,0.9260000,,,,,-1.9300000
GNTSGDETSEPSNNKK,ph,S,893,false,"atm and atr DNA damage response",88,25561503,"MASCOT Score",25.0000000,1.0000000,,,,,-0.1200000
GNTSGDETSEPSNNK,ph,S,893,false,"atm and atr DNA damage response",88,25561503,"MASCOT Score",31.0000000,1.0000000,,,,,0.3900000
YSDEADTQSVISSPQNVPEDK,ph,S,914,false,"Tissue atlas Arabidopsis - ProteomicsDB",114,32188942,"MaxQuant score",118.0500000,0.9956580,,,,2.721189955165E-21,
YSDEADTQSVISSPQNVPEDK,ph,S,917,false,"TOR Kinase and ABA Receptor",100,29290610,XCorr,4.8767853,0.8519000,,,,4.1349998355145E-5,
YSDEADTQSVISSPQNVPEDK,ph,S,917,false,"Tissue atlas Arabidopsis - ProteomicsDB",114,32188942,"MaxQuant score",346.0400000,0.9993100,,,,0,
YSDEADTQSVISSPQNVPEDK,ph,S,918,false,"Tissue atlas Arabidopsis - ProteomicsDB",114,32188942,"MaxQuant score",314.1100000,0.9996650,,,,0,
VTCETEVTNK,ox,C,954,false,"OxiTRAQ Arabidopsis - 5 mM H2O2 versus control",47,24376095,,,,-0.2668971,0.2658535,NO,,
VTTLDCSESPSEAGRK,ph,S,968,false,"atm and atr DNA damage response",88,25561503,"MASCOT Score",49.0000000,1.0000000,,,,,0.3300000
VTTLDCSESPSEAGR,ph,S,968,false,"Tyrosine phosphorylation in Arabidopsis",59,18463617,"MASCOT Score",29.0000000,,,,,,-0.1777593
VTTLDCSESPSEAGR,ph,S,968,false,"Tissue atlas Arabidopsis - ProteomicsDB",114,32188942,"MaxQuant score",198.5100000,0.9989870,,,,0,
VTTLDCSESPSEAGRK,ph,S,970,false,"atm and atr DNA damage response",88,25561503,"MASCOT Score",45.0000000,1.0000000,,,,,-0.2600000
VTTLDCSESPSEAGR,ph,S,970,false,"Tyrosine phosphorylation in Arabidopsis",59,18463617,"MASCOT Score",45.0000000,,,,,,-0.6517843
VTTLDCSESPSEAGR,ph,S,970,false,"Conserved plant phosphoproteome - Arabidopsis",61a,20466843,"MASCOT Score",29.0000000,1.0000000,,,,,
VTTLDCSESPSEAGR,ph,S,970,false,"LAXIC - ABA stress",84a,23660473,XCorr,3.3400000,0.9850000,,,,1.8400000044494E-5,
VTTLDCSESPSEAGR,ph,S,970,false,"LAXIC - mannitol vs control",84b,23660473,XCorr,3.8600000,0.9420000,,,,1.0199999955773E-8,
VTTLDCSESPSEAGR,ph,S,970,false,"SnRK2 protein kinase substrates",85,23776212,XCorr,4.5508966,0.9960000,,,,0.0023543399292976,
VTTLDCSESPSEAGR,ph,S,970,false,"atm and atr DNA damage response",88,25561503,"MASCOT Score",80.0000000,0.9960000,,,,,-0.0400000
VTTLDCSESPSEAGR,ph,S,970,false,"Lateral root-induction - NAA vs control",106,23328941,"MASCOT Score",46.0000000,,,,,,
VTTLDCSESPSEAGR,ph,S,970,false,"Col-0 callus - FC Col-0 vs. Col-0 Xray",111a,31410901,,86.5900000,,-0.2527219,0.0000000,NO,,1.0343635
VTTLDCSESPSEAGR,ph,S,970,false,"Col-0 X-ray callus - FC Col-0 vs. Col-0 Xray",111b,31410901,,86.5900000,,-0.2527219,0.0000000,NO,,1.0343635
VTTLDCSESPSEAGR,ph,S,970,false,"atm callus - FC atm vs. atm Xray",111c,31410901,,86.5900000,,0.0160800,0.0000000,NO,,1.0343635
VTTLDCSESPSEAGR,ph,S,970,false,"atm-3 X-ray callus - FC atm vs. atm Xray",111d,31410901,,86.5900000,,0.0160800,0.0000000,NO,,1.0343635
VTTLDCSESPSEAGR,ph,S,970,false,"Tissue atlas Arabidopsis - ProteomicsDB",114,32188942,"MaxQuant score",337.0300000,0.9999010,,,,0,
VTTLDCSESPSEAGRK,ph,S,972,false,"atm and atr DNA damage response",88,25561503,"MASCOT Score",59.0000000,1.0000000,,,,,-0.2000000
VTTLDCSESPSEAGRK,ph,S,972,false,"Phospho cell culture sucrose/TOR",109,30833711,,,0.8640570,,,,,
VTTLDCSESPSEAGR,ph,S,972,false,"Tyrosine phosphorylation in Arabidopsis",59,18463617,"MASCOT Score",55.0000000,,,,,,-0.8887970
VTTLDCSESPSEAGR,ph,S,972,false,"atm and atr DNA damage response",88,25561503,"MASCOT Score",31.0000000,1.0000000,,,,,-1.1900000
VTTLDCSESPSEAGR,ph,S,972,false,"Lateral root-induction - NAA vs control",106,23328941,"MASCOT Score",60.0000000,,,,,,
VTTLDCSESPSEAGR,ph,S,972,false,"Tissue atlas Arabidopsis - ProteomicsDB",114,32188942,"MaxQuant score",366.9500000,0.9999990,,,,0,
