Peptide,PTM,ModifiedAA,ModifiedPosition,PeptideUniqueToGene,ExperimentDesc,ExpID,PubmedID,ScoreType,IdentScore,LocProb,Log2FChange,PQ-val,QuantSig,PEP,MassErrorPPM
HVTSLDLSGLNLSGTLSPDVSHLR,ng,N,80,true,"Conserved N-glycosylation",74,22633491,"MaxQuant Score",214.1600000,1.0000000,,,,0,-0.5490000
LLQNLSLAENLISGPIPPEISSLSGLR,ng,N,97,true,"Conserved N-glycosylation",74,22633491,"MaxQuant Score",158.0700000,1.0000000,,,,3.783505853677E-44,-0.9040000
VLDVYNNNLTGDLPVSVTNLTQLR,ng,N,164,true,"Conserved N-glycosylation",74,22633491,"MaxQuant Score",196.6500000,1.0000000,,,,0,-0.8230000
IPPEIGNLTTLR,ng,N,212,false,"Conserved N-glycosylation",74,22633491,"MaxQuant Score",140.6400000,1.0000000,,,,2.9120000003989E-14,0.0550000
IPPEIGNLTTLR,ng,N,212,false,"N-linked Glycan Micro-heterogeneity Arabidopsis",134,29237727,,,,,,,,
IPPEIGNLTTLR,ng,N,212,false,"UDP-GlcNAc transporter glycopeptide analysis",135,30224661,,,,,,,7.9889211690443E-8,0.4000000
MGENFLNGSIPK,ng,N,420,false,"Conserved N-glycosylation",74,22633491,"MaxQuant Score",153.2200000,0.9980000,,,,3.9330001318986E-15,-1.0460000
ILNYLNLSR,ng,N,557,false,"Conserved N-glycosylation",74,22633491,"MaxQuant Score",147.0500000,0.9950000,,,,9.9460003184504E-6,-0.1560000
ILNYLNLSR,ng,N,557,false,"UDP-GlcNAc transporter glycopeptide analysis",135,30224661,,,,,,,1.7744801880326E-5,0.3000000
GVMPNGDLVAVKR,ac,K,722,true,"Quantitative Acetylproteomics",101,29440448,,,,,,,,
GDLVAVKR,ac,K,722,false,"Quantitative Acetylproteomics",101,29440448,,,,,,,,
GSSHDHGFNAEIQTLGR,ph,S,731,false,"atm and atr DNA damage response",88,25561503,"MASCOT Score",56.0000000,0.9340000,,,,,-0.7800000
KGGHLHWDTR,ub,K,785,true,"Ubiquitination Membrane Proteins",120,33585938,,,,,,,,
KGGHLHWDTR,ub,K,785,true,"upl3 mutant / wildtype",168,35926874,"MaxQuant score",91.1230000,1.0000000,1.2636354,,,0.0033606300130486,0.9549000
DQPMTESAPESELSPK,ph,S,982,true,"Tissue atlas Arabidopsis - ProteomicsDB",114,32188942,"MaxQuant score",115.7400000,0.9953580,,,,3.7078299897075E-7,
DQPMTESAPESELSPK,ph,S,986,true,"Phytohormone-responsive phosphoproteins",34,20374526,"MASCOT Score",64.0000000,,,,,,
DQPMTESAPESELSPK,ph,S,986,true,"Tyrosine phosphorylation in Arabidopsis",59,18463617,"MASCOT Score",34.0000000,,,,,,-0.7672295
DQPMTESAPESELSPK,ph,S,989,true,"atm and atr DNA damage response",88,25561503,"MASCOT Score",63.0000000,1.0000000,,,,,-0.5300000
DQPMTESAPESELSPK,ph,S,989,true,"TOR Kinase and ABA Receptor",100,29290610,XCorr,4.0350938,0.9141000,,,,1.2129999959143E-5,
DQPMTESAPESELSPK,ph,S,989,true,"Tissue atlas Arabidopsis - ProteomicsDB",114,32188942,"MaxQuant score",271.6400000,0.9993820,,,,0,
SGVQSPPDLLNL,ph,S,992,true,"Chloroplast kinase substrates",60,19376835,"MASCOT Score",36.0200000,,,,,,-0.9270200
SGVQSPPDLLNL,ph,S,992,true,"atm and atr DNA damage response",88,25561503,"MASCOT Score",31.0000000,1.0000000,,,,,0.0500000
SGVQSPPDLLNL,ph,S,992,true,"TOR Kinase and ABA Receptor",100,29290610,XCorr,3.3650644,1.0000000,,,,0.001170999952592,
SGVQSPPDLLNL,ph,S,996,true,"STN8 phosphoproteome",38,21768351,"MASCOT Score",51.8000000,,,,,,-0.5220100
SGVQSPPDLLNL,ph,S,996,true,"Tyrosine phosphorylation in Arabidopsis",59,18463617,"MASCOT Score",38.0000000,,,,,,-0.6825338
SGVQSPPDLLNL,ph,S,996,true,"Chloroplast kinase substrates",60,19376835,"MASCOT Score",57.6900000,,,,,,-0.5220100
SGVQSPPDLLNL,ph,S,996,true,"LAXIC - ABA stress",84a,23660473,XCorr,3.2600000,1.0000000,,,,0.0054044402204454,
SGVQSPPDLLNL,ph,S,996,true,"SnRK2 protein kinase substrates",85,23776212,XCorr,2.2061808,1.0000000,,,,0.051556501537561,
SGVQSPPDLLNL,ph,S,996,true,"atm and atr DNA damage response",88,25561503,"MASCOT Score",41.0000000,1.0000000,,,,,-2.4400000
SGVQSPPDLLNL,ph,S,996,true,"TOR Kinase and ABA Receptor",100,29290610,XCorr,3.9127402,1.0000000,,,,0.0040219998918474,
