Peptide,PTM,ModifiedAA,ModifiedPosition,PeptideUniqueToGene,ExperimentDesc,ExpID,PubmedID,ScoreType,IdentScore,LocProb,Log2FChange,PQ-val,QuantSig,PEP,MassErrorPPM
SSPPSMSSAAAAAVE,nt,S,73,true,"N-terminal ChaFRADIC",92,26010716,"MASCOT Score",79.2800000,,,,,1.1639999684121E-6,
SSAAAAAVESVVS,nta,S,79,true,"Arabidopsis translation initiation landscape - NTA",167a,35069635,,,,,,,,
SAAAAAVESVVSDE,nt,S,80,true,"HUNTER N-terminome: legumain, GluC and trypsin",119,31951383,"MaxQuant score",104.2000000,,,,,,
AAAVESVVSDETLSSNPLLQDFDFPPFDSVDASHVRPGIR,nt,A,83,true,"N-terminal ChaFRADIC",92,26010716,"MASCOT Score",25.5800000,,,,,1.8619999764269E-8,
AAAVESVVSDETLSSNPLLQDFDFPPFDSVDASHVRPGIR,nt,A,83,true,"HUNTER N-terminome: legumain, GluC and trypsin",119,31951383,"MaxQuant score",75.9540000,,,,,,
AAAVESVVSDETLSSN,nt,A,83,true,"HUNTER N-terminome: legumain, GluC and trypsin",119,31951383,"MaxQuant score",125.7400000,,,,,,
AAAVESVVSDE,nt,A,83,true,"N-terminal ChaFRADIC",92,26010716,"MASCOT Score",48.5500000,,,,,9.0829998953268E-5,
AAVESVVSDETLSSNPLLQDFDFPPFDSVDASHVRPGIR,nt,A,84,true,"HUNTER N-terminome: legumain, GluC and trypsin",119,31951383,"MaxQuant score",51.8680000,,,,,,
AAVESVVSDETLSSN,nt,A,84,true,"HUNTER N-terminome: legumain, GluC and trypsin",119,31951383,"MaxQuant score",94.2970000,,,,,,
AAVESVVSDE,nt,A,84,true,"N-terminal ChaFRADIC",92,26010716,"MASCOT Score",65.4200000,,,,,3.6789999285247E-5,
SKPIYNAFKAIRE,nt,S,197,false,"Arabidopsis translation initiation landscape - NT",167b,35069635,,,,,,,,
LSHKFSENVLDATK,ac,K,259,false,"Quantitative Acetylproteomics",101,29440448,,,,,,,,
FSENVLDATKK,ub,K,269,false,"upl3 mutant / wildtype",168,35926874,"MaxQuant score",119.3900000,1.0000000,1.0600474,0.3283000,NO,5.8579698816175E-5,0.2789900
GHENATAENGPWIITLDAPSYLPVMQHAK,ng,N,303,true,"Conserved N-glycosylation",74,22633491,"MaxQuant Score",113.8600000,0.9830000,,,,3.9500000492687E-10,0.0870000
ASSGDLDNTAIIDQILK,ph,S,345,false,"LAXIC - mannitol vs control",84b,23660473,XCorr,3.7000000,0.9170000,,,,3.7200000857496E-9,
ASSGDLDNTAIIDQILK,ph,S,346,false,"srk2dei ABA signaling phopshoproteomics",83,23572148,"MASCOT Score",94.0000000,,,,,,0.0027000
ASSGDLDNTAIIDQILK,ph,S,346,false,"SnRK2 protein kinase substrates",85,23776212,XCorr,4.0894566,0.9070000,,,,2.5003899395415E-8,
ASSGDLDNTAIIDQILK,ph,S,346,false,"TOR Kinase and ABA Receptor",100,29290610,XCorr,4.6580429,0.9781000,,,,3.0319999495987E-5,
LRLEKAK,ac,K,365,false,"Quantitative Acetylproteomics",101,29440448,,,,,,,,
AAELLEKLR,ac,K,395,true,"Histone deacetylases - apicidin vs control",98a,29061669,"MaxQuant Score",67.3000000,1.0000000,0.1330000,0.4698941,NO,0.0080000003799796,
AAELLEKLR,ac,K,395,true,"Quantitative Acetylproteomics",101,29440448,,,,,,,,
SVRLPVAH,nt,S,538,true,"N-terminal ChaFRADIC",92,26010716,"MASCOT Score",27.6000000,,,,,1.8389999240753E-5,
VSVKTQVIPPLPEDR,ac,K,685,true,"Quantitative Acetylproteomics",101,29440448,,,,,,,,
GREPSPEPLLR,ph,S,774,false,"Phosphoproteome ethylene-regulated time response",46,24043427,"MASCOT Score",33.8500000,,,,,,8.0613000
GREPSPEPLLR,ph,S,774,false,"Tyrosine phosphorylation in Arabidopsis",59,18463617,"MASCOT Score",33.0000000,,,,,,-0.7520814
GREPSPEPLLR,ph,S,774,false,"SnRK2 protein kinase substrates",85,23776212,XCorr,2.7120550,1.0000000,,,,0.006633410230279,
GREPSPEPLLR,ph,S,774,false,"atm and atr DNA damage response",88,25561503,"MASCOT Score",38.0000000,1.0000000,,,,,0.2100000
GREPSPEPLLR,ph,S,774,false,"TOR Kinase and ABA Receptor",100,29290610,XCorr,3.1995292,1.0000000,,,,0.017990000545979,
GREPSPEPLLR,ph,S,774,false,"Phospho cell culture sucrose/TOR",109,30833711,,,1.0000000,,,,,
GREPSPEPLLR,ph,S,774,false,"Tissue atlas Arabidopsis - ProteomicsDB",114,32188942,"MaxQuant score",151.9900000,1.0000000,,,,1.7940500640634E-8,
HNGLLAASASA,ph,S,790,true,"Tissue atlas Arabidopsis - ProteomicsDB",114,32188942,"MaxQuant score",151.9200000,0.9999990,,,,9.9878700865474E-9,
