Peptide,PTM,ModifiedAA,ModifiedPosition,PeptideUniqueToGene,ExperimentDesc,ExpID,PubmedID,ScoreType,IdentScore,LocProb,Log2FChange,PQ-val,QuantSig,PEP,MassErrorPPM
SKPSSSPFFSE,nt,S,2,true,"Arg/N-end rule seed, prt6 vs. Wt",99,29168982,"MASCOT Score",33.1500000,,,,,0.0026630000211298,-1.6228652
SKPSSSPFFSETTSRLQ,nta,S,2,true,"Arabidopsis translation initiation landscape - NTA",167a,35069635,,,,,,,,
SKPSSSPFFSE,nta,S,2,true,"Arg/N-end rule seed, prt6 vs. Wt",99,29168982,"MASCOT Score",33.1500000,,-0.0116500,0.9217778,NO,0.0026630000211298,-1.6228652
SKPSSSPFFSETTSR,ph,S,2,true,"Tissue atlas Arabidopsis - ProteomicsDB",114,32188942,"MaxQuant score",96.7730000,0.9849740,,,,6.4043101701827E-6,
VSSYKGAEVPENR,ph,S,475,true,"atm and atr DNA damage response",88,25561503,"MASCOT Score",36.0000000,0.9480000,,,,,-0.4700000
VSSYKGAEVPENR,ph,S,475,true,"Phospho cell culture sucrose/TOR",109,30833711,,,0.9930100,,,,,
VSSYKGAEVPENR,ph,S,475,true,"Tissue atlas Arabidopsis - ProteomicsDB",114,32188942,"MaxQuant score",119.0000000,0.9946870,,,,6.1739003285766E-5,
EVSIDVDR,ph,S,491,true,"Tissue atlas Arabidopsis - ProteomicsDB",114,32188942,"MaxQuant score",133.4800000,1.0000000,,,,5.3778398978466E-6,
DIESMLGSQGR,ph,S,507,true,"Tissue atlas Arabidopsis - ProteomicsDB",114,32188942,"MaxQuant score",150.4900000,1.0000000,,,,1.6291599180818E-8,
SFENVNQQHSSK,ph,S,570,true,"Tissue atlas Arabidopsis - ProteomicsDB",114,32188942,"MaxQuant score",234.9000000,1.0000000,,,,0,
