Peptide,PTM,ModifiedAA,ModifiedPosition,PeptideUniqueToGene,ExperimentDesc,ExpID,PubmedID,ScoreType,IdentScore,LocProb,Log2FChange,PQ-val,QuantSig,PEP,MassErrorPPM
KSPSSEEGVHR,ph,S,22,true,"atm and atr DNA damage response",88,25561503,"MASCOT Score",45.0000000,0.9990000,,,,,-1.2800000
KSPSSEEGVHR,ph,S,22,true,"Tissue atlas Arabidopsis - ProteomicsDB",114,32188942,"MaxQuant score",196.9700000,0.9996310,,,,2.5063500182053E-19,
KSPSSEEGVHR,ph,S,24,true,"atm and atr DNA damage response",88,25561503,"MASCOT Score",29.0000000,0.8370000,,,,,-0.6900000
KSPSSEEGVHR,ph,S,25,true,"Tissue atlas Arabidopsis - ProteomicsDB",114,32188942,"MaxQuant score",50.8740000,0.9452570,,,,0.0080041904002428,
TPSSMLR,ph,S,34,true,"Tissue atlas Arabidopsis - ProteomicsDB",114,32188942,"MaxQuant score",125.0400000,0.9995420,,,,0.0062247300520539,
RYSIPK,ph,S,41,false,"srk2dei ABA signaling phopshoproteomics",83,23572148,"MASCOT Score",29.0000000,,,,,,0.0003000
ISPLINEK,ph,S,119,false,"atm and atr DNA damage response",88,25561503,"MASCOT Score",40.0000000,1.0000000,,,,,-1.2900000
DLLSGCQSNLPK,sno,C,281,true,"hot5-4 / wildtype, FAT-switch S-nitrosoproteome",169,37277371,,,,0.3701629,0.0014804,NO,,
ILADSLGGSSK,ph,S,416,true,"Phosphorylation in N starvation",63,22060019,"MASCOT Score",22.0000000,,,,,,6.3082900
SRDPLEPQPR,ph,S,596,true,"atm and atr DNA damage response",88,25561503,"MASCOT Score",34.0000000,1.0000000,,,,,0.1100000
SVASSTQVSSPSSK,ph,S,657,true,"Lateral root-induction - NAA vs control",106,23328941,"MASCOT Score",41.0000000,,,,,,
SVASSTQVSSPSSK,ph,S,658,true,"Large-scale phosphorylation discovery",44,23111157,XCorr,4.1090000,,,,,,
SVASSTQVSSPSSK,ph,S,658,true,"SnRK2 protein kinase substrates",85,23776212,XCorr,2.9849732,0.9960000,,,,1.0054400263471E-6,
SVASSTQVSSPSSK,ph,S,658,true,"atm and atr DNA damage response",88,25561503,"MASCOT Score",59.0000000,0.9970000,,,,,1.1500000
SVASSTQVSSPSSK,ph,S,658,true,"TOR Kinase and ABA Receptor",100,29290610,XCorr,4.1614628,0.9299000,,,,1.9829999473586E-6,
SVASSTQVSSPSSK,ph,S,658,true,"Lateral root-induction - NAA vs control",106,23328941,"MASCOT Score",90.0000000,,0.3778012,0.1393283,NO,,
SVASSTQVSSPSSK,ph,S,658,true,"Phospho cell culture sucrose/TOR",109,30833711,,,0.8903540,,,,,
SVASSTQVSSPSSK,ph,S,658,true,"Col-0 callus - FC Col-0 vs. Col-0 Xray",111a,31410901,,63.7100000,,0.5619319,0.0000000,NO,,0.1288886
SVASSTQVSSPSSK,ph,S,658,true,"Col-0 X-ray callus - FC Col-0 vs. Col-0 Xray",111b,31410901,,63.7100000,,0.5619319,0.0000000,NO,,0.1288886
SVASSTQVSSPSSK,ph,S,658,true,"atm callus - FC atm vs. atm Xray",111c,31410901,,63.7100000,,-0.2816874,0.0000000,NO,,0.1288886
SVASSTQVSSPSSK,ph,S,658,true,"atm-3 X-ray callus - FC atm vs. atm Xray",111d,31410901,,63.7100000,,-0.2816874,0.0000000,NO,,0.1288886
SVASSTQVSSPSSK,ph,S,658,true,"Tissue atlas Arabidopsis - ProteomicsDB",114,32188942,"MaxQuant score",278.8500000,0.9639980,,,,0,
SSSGSSSPGRSPVRYYDEQIYGFK,ph,S,818,true,"srk2dei ABA signaling phopshoproteomics",83,23572148,"MASCOT Score",26.0000000,,,,,,-0.0026000
SSSGSSSPGRSPVR,ph,S,820,true,"atm and atr DNA damage response",88,25561503,"MASCOT Score",28.0000000,0.9120000,,,,,0.7600000
SSSGSSSPGRSPVR,ph,S,820,true,"Tissue atlas Arabidopsis - ProteomicsDB",114,32188942,"MaxQuant score",77.1920000,0.8629870,,,,7.2837399784476E-5,
SSSGSSSPGRSPVRYYDEQIYGFK,ph,S,824,true,"Brassinosteroid-Regulated Phosphorylation Dynamics",94,26187819,"MaxQuant Score",73.1090000,0.7930000,,,,0.012000000104308,1.0250000
SSSGSSSPGRSPVR,ph,S,824,true,"atm and atr DNA damage response",88,25561503,"MASCOT Score",50.0000000,0.9950000,,,,,-0.1100000
SSSGSSSPGRSPVR,ph,S,824,true,"Tissue atlas Arabidopsis - ProteomicsDB",114,32188942,"MaxQuant score",123.0800000,0.9574230,,,,1.8742799626219E-16,
SSSGSSSPGRSPVRYYDEQIYGFK,ph,S,828,true,"srk2dei ABA signaling phopshoproteomics",83,23572148,"MASCOT Score",26.0000000,,,,,,-0.0026000
SSSGSSSPGRSPVRYYDEQIYGFK,ph,S,828,true,"Brassinosteroid-Regulated Phosphorylation Dynamics",94,26187819,"MaxQuant Score",73.1090000,0.9850000,,,,0.012000000104308,1.0250000
SSSGSSSPGRSPVRYYDEQIYGFK,ph,S,828,true,"Tissue atlas Arabidopsis - ProteomicsDB",114,32188942,"MaxQuant score",109.7700000,0.9994800,,,,6.7923798674885E-21,
SSSGSSSPGRSPVR,ph,S,828,true,"atm and atr DNA damage response",88,25561503,"MASCOT Score",40.0000000,0.9930000,,,,,0.1800000
LVSVVSR,ph,S,857,true,"TOR Kinase and ABA Receptor",100,29290610,XCorr,2.3458672,0.9989000,,,,0.023669999092817,
SALESVDHKR,ac,K,1011,false,"Quantitative Acetylproteomics",101,29440448,,,,,,,,
SDAALFTLEEGSSPVQNPSTAAEDSR,ph,S,1033,true,"srk2dei ABA signaling phopshoproteomics",83,23572148,"MASCOT Score",42.0000000,,,,,,0.0008000
SDAALFTLEEGSSPVQNPSTAAEDSR,ph,S,1033,true,"LAXIC - ABA stress",84a,23660473,XCorr,6.0500000,0.8940000,,,,0.00013012500130571,
SDAALFTLEEGSSPVQNPSTAAEDSR,ph,S,1033,true,"LAXIC - mannitol vs control",84b,23660473,XCorr,5.0000000,0.9280000,,,,1.8999999490399E-11,
SDAALFTLEEGSSPVQNPSTAAEDSR,ph,S,1033,true,"SnRK2 protein kinase substrates",85,23776212,XCorr,5.7674413,0.9960000,,,,4.2069099939757E-12,
SDAALFTLEEGSSPVQNPSTAAEDSR,ph,S,1033,true,"Lateral root-induction - NAA vs control",106,23328941,"MASCOT Score",30.0000000,,,,,,
SDAALFTLEEGSSPVQNPSTAAEDSR,ph,S,1033,true,"Col-0 callus - FC Col-0 vs. Col-0 Xray",111a,31410901,,47.4700000,,2.0506388,0.0152371,YES,,0.1264169
SDAALFTLEEGSSPVQNPSTAAEDSR,ph,S,1033,true,"Col-0 X-ray callus - FC Col-0 vs. Col-0 Xray",111b,31410901,,47.4700000,,2.0506388,0.0152371,YES,,0.1264169
SDAALFTLEEGSSPVQNPSTAAEDSR,ph,S,1033,true,"atm callus - FC atm vs. atm Xray",111c,31410901,,47.4700000,,0.8635981,0.1041360,NO,,0.1264169
SDAALFTLEEGSSPVQNPSTAAEDSR,ph,S,1033,true,"atm-3 X-ray callus - FC atm vs. atm Xray",111d,31410901,,47.4700000,,0.8635981,0.1041360,NO,,0.1264169
MPSLLDVDHPCAQR,so,C,1101,true,"Arabidopsis S-sulfenylation chemoproteomics",108,31578252,"pFind PSM Score",0.0199714,,1.1126100,,,,0.9053123
