Peptide,PTM,ModifiedAA,ModifiedPosition,PeptideUniqueToGene,ExperimentDesc,ExpID,PubmedID,ScoreType,IdentScore,LocProb,Log2FChange,PQ-val,QuantSig,PEP,MassErrorPPM
ASTESHETTGTTSTGGGGGFMVVHGGGGSR,og,S,44,true,"O-GlcNac Inflorescence Tissue",81,28154133,"MASCOT Score",53.6000000,,,,,,0.6200000
ASTESHETTGTTSTGGGGGFMVVHGGGGSR,og,T,50,true,"O-GlcNac Inflorescence Tissue",81,28154133,"MASCOT Score",33.2000000,,,,,,5.4000000
ASTESHETTGTTSTGGGGGFMVVHGGGGSR,og,T,51,true,"O-GlcNac Inflorescence Tissue",81,28154133,"MASCOT Score",41.4000000,,,,,,2.3000000
ERSEDPMETSSAEAGGGIRK,ph,S,175,true,"TOR Kinase and ABA Receptor",100,29290610,XCorr,3.5679021,1.0000000,,,,1.7830000160757E-6,
ERSEDPMETSSAEAGGGIR,ph,S,175,true,"STN8 phosphoproteome",38,21768351,"MASCOT Score",58.2600000,,,,,,
ERSEDPMETSSAEAGGGIR,ph,S,175,true,"Phosphoproteomic analysis of seed maturation",42,22440515,"MASCOT Score",55.0000000,,,,,,2.1500000
ERSEDPMETSSAEAGGGIR,ph,S,175,true,"LAXIC - ABA stress",84a,23660473,XCorr,2.3100000,0.8880000,,,,0.0039867297746241,
ERSEDPMETSSAEAGGGIR,ph,S,175,true,"LAXIC - mannitol vs control",84b,23660473,XCorr,2.9800000,0.9320000,,,,0.0037977600004524,
ERSEDPMETSSAEAGGGIR,ph,S,175,true,"SnRK2 protein kinase substrates",85,23776212,XCorr,2.9810700,1.0000000,,,,0.0018494999967515,
ERSEDPMETSSAEAGGGIR,ph,S,175,true,"atm and atr DNA damage response",88,25561503,"MASCOT Score",107.0000000,1.0000000,,,,,-0.2400000
ERSEDPMETSSAEAGGGIR,ph,S,175,true,"TOR Kinase and ABA Receptor",100,29290610,XCorr,3.9969473,0.8537000,,,,1.5670000721002E-5,
ERSEDPMETSSAEAGGGIR,ph,S,175,true,"Tissue atlas Arabidopsis - ProteomicsDB",114,32188942,"MaxQuant score",169.7200000,1.0000000,,,,5.4030799402168E-28,
ERSEDPMETSSAEAGGGIR,ph,S,175,true,"Touch-induced phosphorylation: 40s touch vs untouc",136,30291188,"MASCOT score",77.3800000,,-0.3096666,0.5214687,NO,,2.3907065
SEDPMETSSAEAGGGIR,ph,S,175,true,"STN8 phosphoproteome",38,21768351,"MASCOT Score",83.6400000,,,,,,
SEDPMETSSAEAGGGIR,ph,S,175,true,"atm and atr DNA damage response",88,25561503,"MASCOT Score",62.0000000,1.0000000,,,,,-1.1300000
ERSEDPMETSSAEAGGGIR,ph,T,181,true,"TOR Kinase and ABA Receptor",100,29290610,XCorr,2.7377653,0.9531000,,,,0.00048419999075122,
ERSEDPMETSSAEAGGGIR,ph,S,182,true,"atm and atr DNA damage response",88,25561503,"MASCOT Score",59.0000000,0.9460000,,,,,-0.3200000
SEDPMETSSAEAGGGIR,ph,S,182,true,"atm and atr DNA damage response",88,25561503,"MASCOT Score",46.0000000,0.9960000,,,,,-0.3000000
SEDPMETSSAEAGGGIR,ph,S,182,true,"Tissue atlas Arabidopsis - ProteomicsDB",114,32188942,"MaxQuant score",183.7000000,0.8806120,,,,1.2611686178923E-44,
ERSEDPMETSSAEAGGGIRK,ph,S,183,true,"TOR Kinase and ABA Receptor",100,29290610,XCorr,3.2564926,0.8605000,,,,0.010130000300705,
ERSEDPMETSSAEAGGGIR,ph,S,183,true,"SnRK2 protein kinase substrates",85,23776212,XCorr,2.6122186,0.8620000,,,,4.2717598347508E-9,
ERSEDPMETSSAEAGGGIR,ph,S,183,true,"atm and atr DNA damage response",88,25561503,"MASCOT Score",52.0000000,0.9960000,,,,,-0.1900000
ERSEDPMETSSAEAGGGIR,ph,S,183,true,"Tissue atlas Arabidopsis - ProteomicsDB",114,32188942,"MaxQuant score",130.4000000,0.9106720,,,,2.3251800485014E-10,
SEDPMETSSAEAGGGIR,ph,S,183,true,"atm and atr DNA damage response",88,25561503,"MASCOT Score",69.0000000,0.9440000,,,,,-0.7500000
TKFTAEQKER,nt,T,196,true,"Metacaspase9 substrates - Col-0 / mc9",51a,23964026,"MASCOT Score",51.0000000,,1.2868375,,NO,,-1.5080741
SPSPLHHHQAPPPPPPQSSFHHEQDQP,ph,S,255,true,"Tissue atlas Arabidopsis - ProteomicsDB",114,32188942,"MaxQuant score",153.8600000,0.8906060,,,,0,
SPSPLHHHQAPPPPPPQSSFHHEQDQP,ph,S,271,true,"TOR Kinase and ABA Receptor",100,29290610,XCorr,3.9499235,0.9356000,,,,0.013120000250638,
