Peptide,PTM,ModifiedAA,ModifiedPosition,PeptideUniqueToGene,ExperimentDesc,ExpID,PubmedID,ScoreType,IdentScore,LocProb,Log2FChange,PQ-val,QuantSig,PEP,MassErrorPPM
ASLKVPSNVPLPEDDAEQLHKAF,nt,A,2,true,"Arg/N-end rule seed, prt6 vs. Wt",99,29168982,"MASCOT Score",33.6500000,,,,,6.6400003561284E-5,-2.1192090
ASLKVPSNVPLPEDDAEQLH,nt,A,2,true,"Arg/N-end rule seed, prt6 vs. Wt",99,29168982,"MASCOT Score",20.9300000,,,,,0.00093899999046698,-1.0423740
ASLKVPSNVPLPEDDAE,nt,A,2,true,"N-terminal ChaFRADIC",92,26010716,"MASCOT Score",21.0200000,,,,,0.00067480001598597,
ASLKVPSNVPLPEDDAE,nt,A,2,true,"Arg/N-end rule seed, prt6 vs. Wt",99,29168982,"MASCOT Score",24.3700000,,,,,0.00053090002620593,-3.0381512
ASLKVPSNVPLPEDD,nt,A,2,true,"N-terminal ChaFRADIC",92,26010716,"MASCOT Score",33.4600000,,,,,0.033920001238585,
ASLKVPSNVPLPEDD,nt,A,2,true,"Arg/N-end rule seed, prt6 vs. Wt",99,29168982,"MASCOT Score",24.6300000,,,,,1.1039999662898E-5,2.6103828
ASLKVPSNVPLPE,nt,A,2,true,"N-terminal ChaFRADIC",92,26010716,"MASCOT Score",35.0500000,,,,,0.070639997720718,
ASLKVPSNVPLPE,nt,A,2,true,"Arg/N-end rule seed, prt6 vs. Wt",99,29168982,"MASCOT Score",60.6300000,,,,,2.1210000340943E-5,-1.1174675
ASLKVPSNVPLPEDDAEQLHKAFSGW,nta,A,2,true,"Arg/N-end rule pathway Roots",80,25728785,"MASCOT Score",59.4200000,,,,,2.5220001020898E-7,
ASLKVPSNVPLPEDDAEQLHKAF,nta,A,2,true,"Arg/N-end rule pathway Roots",80,25728785,"MASCOT Score",52.1700000,,,,,2.6719999368652E-6,
ASLKVPSNVPLPEDDAEQLHKAF,nta,A,2,true,"Arg/N-end rule seed, prt6 vs. Wt",99,29168982,"MASCOT Score",33.6500000,,-0.1248540,0.8293628,NO,6.6400003561284E-5,-2.1192090
ASLKVPSNVPLPEDDAEQLHKAF,nta,A,2,true,"Arabidopsis translation initiation landscape - NTA",167a,35069635,,,,,,,,
ASLKVPSNVPLPEDDAEQLH,nta,A,2,true,"Arg/N-end rule seed, prt6 vs. Wt",99,29168982,"MASCOT Score",20.9300000,,-0.3166889,0.2947101,NO,0.00093899999046698,-1.0423740
ASLKVPSNVPLPEDDAE,nta,A,2,true,"N-terminal ChaFRADIC",92,26010716,"MASCOT Score",21.0200000,,,,,0.00067480001598597,
ASLKVPSNVPLPEDDAE,nta,A,2,true,"Arg/N-end rule seed, prt6 vs. Wt",99,29168982,"MASCOT Score",24.3700000,,0.4275267,0.4088312,NO,0.00053090002620593,-3.0381512
ASLKVPSNVPLPEDD,nta,A,2,true,"N-terminal ChaFRADIC",92,26010716,"MASCOT Score",33.4600000,,,,,0.033920001238585,
ASLKVPSNVPLPEDD,nta,A,2,true,"Arg/N-end rule seed, prt6 vs. Wt",99,29168982,"MASCOT Score",24.6300000,,-0.5283503,0.2036589,NO,1.1039999662898E-5,2.6103828
ASLKVPSNVPLPE,nta,A,2,true,"N-terminal ChaFRADIC",92,26010716,"MASCOT Score",35.0500000,,,,,0.070639997720718,
ASLKVPSNVPLPE,nta,A,2,true,"Arg/N-end rule seed, prt6 vs. Wt",99,29168982,"MASCOT Score",60.6300000,,-0.1663853,0.3201709,NO,2.1210000340943E-5,-1.1174675
SLKVPSNVPLPE,nt,S,3,true,"Arg/N-end rule seed, prt6 vs. Wt",99,29168982,"MASCOT Score",34.8500000,,,,,0.00013919999764767,0.4123878
SLKVPSNVPLPE,nta,S,3,true,"Arg/N-end rule seed, prt6 vs. Wt",99,29168982,"MASCOT Score",34.8500000,,-0.8522246,0.1544308,NO,0.00013919999764767,0.4123878
PALELIKVK,ub,K,120,true,"upl3 mutant / wildtype",168,35926874,"MaxQuant score",62.4630000,1.0000000,-0.5228408,,,0.006837610155344,0.3896200
SYSDDDFIRIL,nt,S,183,true,"N-terminal ChaFRADIC",92,26010716,"MASCOT Score",22.5100000,,,,,4.6599998313468E-5,
ATLNHYNNE,nt,A,203,true,"Arg/N-end rule seed, prt6 vs. Wt",99,29168982,"MASCOT Score",43.9300000,,-0.3665553,0.5170989,NO,0.040970001369715,-1.4243603
AVITCLTYPE,nt,A,235,true,"Arg/N-end rule seed, prt6 vs. Wt",99,29168982,"MASCOT Score",31.2700000,,0.0699490,0.7597482,NO,0.015089999884367,7.6275548
AIAKDTSGDYEDMLVALLGHGDA,nt,A,295,true,"Arabidopsis translation initiation landscape - NT",167b,35069635,,,,,,,,
AIAKDTSGDYEDMLVALLGHGDA,ph,T,300,true,"SnRK2 protein kinase substrates",85,23776212,XCorr,2.7054019,0.8130000,,,,9.5701097961864E-6,
DTSGDYEDMLVALLGHGDA,ph,S,301,true,"Arabidopsis root NAA phosphoproteome",18a,27643528,"MaxQuant Score",72.4330000,0.8390000,,,,1.0960000196292E-7,-0.3770000
DTSGDYEDMLVALLGHGDA,ph,S,301,true,"Large-scale phosphorylation discovery",44,23111157,XCorr,5.0890000,,,,,,
DTSGDYEDMLVALLGHGDA,ph,S,301,true,"SnRK2 protein kinase substrates",85,23776212,XCorr,4.5110226,0.9640000,,,,3.96250006599E-16,
DTSGDYEDMLVALLGHGDA,ph,S,301,true,"Tissue atlas Arabidopsis - ProteomicsDB",114,32188942,"MaxQuant score",150.1200000,0.9966940,,,,1.4097199740041E-18,
