Peptide,PTM,ModifiedAA,ModifiedPosition,PeptideUniqueToGene,ExperimentDesc,ExpID,PubmedID,ScoreType,IdentScore,LocProb,Log2FChange,PQ-val,QuantSig,PEP,MassErrorPPM
CGILAVLGCIDNSQAKRSRIIE,nt,C,2,true,"Arabidopsis translation initiation landscape - NT",167b,35069635,,,,,,,,
CGILAVLGCIDNSQAKR,nt,C,2,true,"Stromal N-terminome",96,26371235,"MASCOT Score",55.6700000,,,,,,
CGILAVLGCIDN,nt,C,2,true,"HUNTER N-terminome: legumain, GluC and trypsin",119,31951383,"MaxQuant score",138.1100000,,,,,,
CGILAVLGCIDNSQAK,so,C,10,true,"S-sulfenylation site detection using YAP1C",110,32714340,,,,,,,,
GPDWSGLHCYEDCYLAHER,sno,C,40,false,"Site-specific nitrosomeproteomic id - gsnor1-3",90b,25699590,XCorr,2.8300000,,,,,0.005644999910146,-7.1400000
LAIIDPTSGDQPLYNEDK,ph,T,57,true,"SIRK1 phosphorylation",86a,23820729,"MaxQuant Score",62.3410000,0.9760000,,,,1.1560000181198,2.4240000
LAIIDPTSGDQPLYNEDK,ph,T,57,true,"SIRK1 exp - sirk1 mutant vs WT",86b,23820729,,,,1.7743567,,NO,,
LAIIDPTSGDQPLYNEDK,ph,S,58,true,"SIRK1 phosphorylation",86a,23820729,"MaxQuant Score",62.3410000,0.9760000,,,,1.1560000181198,2.4240000
LAIIDPTSGDQPLYNEDK,ph,S,58,true,"SIRK1 exp - sirk1 mutant vs WT",86b,23820729,,,,1.7743567,,NO,,
NAFEKAVIK,ac,K,216,true,"Histone deacetylases substrates - hda14 vs WT",98e,29061669,"MaxQuant Score",43.8000000,1.0000000,0.2610000,0.6760830,NO,0.021999999880791,
NAFEKAVIK,ub,K,216,true,"upl3 mutant / wildtype",168,35926874,"MaxQuant score",64.7110000,1.0000000,-0.5104571,,,0.022129099816084,0.6348000
EVADYLGTR,nt,E,280,false,"Arabidopsis translation initiation landscape - NT",167b,35069635,,,,,,,,
KIKSLGVK,ac,K,332,false,"Quantitative Acetylproteomics",101,29440448,,,,,,,,
IKSLGVK,ac,K,332,false,"Quantitative Acetylproteomics",101,29440448,,,,,,,,
EFHEETCR,ox,C,369,false,"OxiTRAQ Arabidopsis - 5 mM H2O2 versus control",47,24376095,,,,0.1196010,0.2219859,NO,,
EFHEETCR,sno,C,369,false,"hot5-4 / wildtype, FAT-switch S-nitrosoproteome",169,37277371,,,,,,,,
KEFHEETCRK,so,C,369,false,"S-sulfenylation site detection using YAP1C",110,32714340,,,,,,,,
EFHEETCR,so,C,369,false,"Arabidopsis S-sulfenylation chemoproteomics",108,31578252,"pFind PSM Score",0.1501070,,1.6557200,,,,-1.1169279
ALHQFDCLR,sno,C,380,true,"Site-specific nitrosomeproteomic id - gsnor1-3",90a,25699590,XCorr,2.2124300,,,,,0.024909999221563,-6.0546256
ALHQFDCLR,sno,C,380,true,"hot5-4 / wildtype, FAT-switch S-nitrosoproteome",169,37277371,,,,0.3985196,0.0411979,NO,,
ALHQFDCLR,so,C,380,true,"Arabidopsis S-sulfenylation chemoproteomics",108,31578252,"pFind PSM Score",0.0042734,,0.9396200,,,,-0.5537010
ANKSTSAWGVEAR,ac,K,385,false,"Quantitative Acetylproteomics",101,29440448,,,,,,,,
NAFDDEERPYLPKHILYR,ac,K,443,true,"Quantitative Acetylproteomics",101,29440448,,,,,,,,
FFPKSAAR,ac,K,508,false,"Quantitative Acetylproteomics",101,29440448,,,,,,,,
ATVPGGPSIACSTAK,sno,C,523,true,"Site-specific nitrosomeproteomic id - gsnor1-3",90a,25699590,XCorr,2.1545258,,,,,0.010440000332892,-6.9580412
ATVPGGPSIACSTAK,sno,C,523,true,"hot5-4 / wildtype, FAT-switch S-nitrosoproteome",169,37277371,,,,0.4265138,0.1749253,NO,,
ATVPGGPSIACSTAK,so,C,523,true,"S-sulfenylation site detection using YAP1C",110,32714340,,,,,,,,
AAAAAKAGSDLVDPLPK,ub,K,564,true,"upl3 mutant / wildtype",168,35926874,"MaxQuant score",61.2650000,1.0000000,0.7815695,0.4290600,NO,0.00030639200122096,0.6613800
AGSDLVDPLPK,ph,S,567,true,"Pollen phosphoproteome Arabidopsis",43,22631563,"MASCOT Score",35.5300000,,,,,,-0.5587770
AGSDLVDPLPK,ph,S,567,true,"srk2dei ABA signaling phopshoproteomics",83,23572148,"MASCOT Score",45.0000000,,,,,,0.0006000
AGSDLVDPLPK,ph,S,567,true,"SnRK2 protein kinase substrates",85,23776212,XCorr,2.0396376,1.0000000,,,,0.00014311200357042,
AGSDLVDPLPK,ph,S,567,true,"atm and atr DNA damage response",88,25561503,"MASCOT Score",48.0000000,1.0000000,,,,,-0.6200000
AGSDLVDPLPK,ph,S,567,true,"Tissue atlas Arabidopsis - ProteomicsDB",114,32188942,"MaxQuant score",176.3200000,1.0000000,,,,2.7128000366916E-12,
