Peptide,PTM,ModifiedAA,ModifiedPosition,PeptideUniqueToGene,ExperimentDesc,ExpID,PubmedID,ScoreType,IdentScore,LocProb,Log2FChange,PQ-val,QuantSig,PEP,MassErrorPPM
AAAAFGQLNLEEPPPIWGSR,nta,A,2,true,"HUNTER N-terminome: legumain, GluC and trypsin",119,31951383,"MaxQuant score",133.7100000,,,,,,
EIVTSPGRDRDDQGKPDNNK,ph,T,93,false,"srk2dei ABA signaling phopshoproteomics",83,23572148,"MASCOT Score",30.0000000,,,,,,0.0008000
EIVTSPGRDRDDQGKPDNNK,ph,T,93,false,"TOR Kinase and ABA Receptor",100,29290610,XCorr,3.2553847,0.8645000,,,,0.0076179997995496,
EIVTSPGR,ph,T,93,false,"atm and atr DNA damage response",88,25561503,"MASCOT Score",25.0000000,0.9450000,,,,,-0.4200000
EIVTSPGR,ph,T,93,false,"Tissue atlas Arabidopsis - ProteomicsDB",114,32188942,"MaxQuant score",108.9800000,0.8307770,,,,0.01043379958719,
EIVTSPGRDR,ph,S,94,false,"atm and atr DNA damage response",88,25561503,"MASCOT Score",24.0000000,0.9320000,,,,,-0.4400000
EIVTSPGR,ph,S,94,false,"Large-scale phosphorylation discovery",44,23111157,XCorr,2.3130000,,,,,,
EIVTSPGR,ph,S,94,false,"atm and atr DNA damage response",88,25561503,"MASCOT Score",37.0000000,0.9570000,,,,,-0.0900000
EIVTSPGR,ph,S,94,false,"TOR Kinase and ABA Receptor",100,29290610,XCorr,2.6632013,0.9243000,,,,0.018400000408292,
EIVTSPGR,ph,S,94,false,"Phospho cell culture sucrose/TOR",109,30833711,,,0.9961520,,,,,
EIVTSPGR,ph,S,94,false,"Col-0 callus - FC Col-0 vs. Col-0 Xray",111a,31410901,,25.3600000,,-0.0886447,0.0000000,NO,,-0.1598029
EIVTSPGR,ph,S,94,false,"Col-0 X-ray callus - FC Col-0 vs. Col-0 Xray",111b,31410901,,25.3600000,,-0.0886447,0.0000000,NO,,-0.1598029
EIVTSPGR,ph,S,94,false,"atm callus - FC atm vs. atm Xray",111c,31410901,,25.3600000,,-0.7735941,0.0000000,NO,,-0.1598029
EIVTSPGR,ph,S,94,false,"atm-3 X-ray callus - FC atm vs. atm Xray",111d,31410901,,25.3600000,,-0.7735941,0.0000000,NO,,-0.1598029
EIVTSPGR,ph,S,94,false,"Tissue atlas Arabidopsis - ProteomicsDB",114,32188942,"MaxQuant score",154.0500000,0.9996720,,,,4.513490057434E-5,
SYSHDHTGNLTNR,nt,S,188,false,"Arabidopsis translation initiation landscape - NT",167b,35069635,,,,,,,,
SYSHDHTGNLTNR,ph,S,190,false,"Conserved plant phosphoproteome - Arabidopsis",61a,20466843,"MASCOT Score",40.0000000,1.0000000,,,,,
SYSHDHTGNLTNR,ph,S,190,false,"Tissue atlas Arabidopsis - ProteomicsDB",114,32188942,"MaxQuant score",131.7200000,0.9833100,,,,1.558800067869E-5,
SYSHDHTGNLTNR,ph,T,194,false,"srk2dei ABA signaling phopshoproteomics",83,23572148,"MASCOT Score",34.0000000,,,,,,-0.0007000
SYSHDHTGNLTNR,ph,T,194,false,"Lateral root-induction - NAA vs control",106,23328941,"MASCOT Score",37.0000000,,,,,,
SYSHDHTGNLTNR,ph,T,198,false,"Ph protein kinases and peptide chip analysis",27,18433157,,,,,,,,
SYSHDHTGNLTNR,ph,T,198,false,"Tyrosine phosphorylation in Arabidopsis",59,18463617,"MASCOT Score",40.0000000,,,,,,-0.8857197
SYSHDHTGNLTNR,ph,T,198,false,"srk2dei ABA signaling phopshoproteomics",83,23572148,"MASCOT Score",33.0000000,,,,,,-0.0002000
SYSHDHTGNLTNR,ph,T,198,false,"SnRK2 protein kinase substrates",85,23776212,XCorr,2.4903653,0.9260000,,,,0.0080914199352264,
SYSHDHTGNLTNR,ph,T,198,false,"atm and atr DNA damage response",88,25561503,"MASCOT Score",55.0000000,0.9160000,,,,,-0.1400000
SYSHDHTGNLTNR,ph,T,198,false,"Lateral root-induction - NAA vs control",106,23328941,"MASCOT Score",22.0000000,,,,,,
SYSHDHTGNLTNR,ph,T,198,false,"Phospho cell culture sucrose/TOR",109,30833711,,,1.0000000,,,,,
SYSHDHTGNLTNR,ph,T,198,false,"Col-0 callus - FC Col-0 vs. Col-0 Xray",111a,31410901,,58.5400000,,-0.3150915,0.0000000,NO,,0.1961036
SYSHDHTGNLTNR,ph,T,198,false,"Col-0 X-ray callus - FC Col-0 vs. Col-0 Xray",111b,31410901,,58.5400000,,-0.3150915,0.0000000,NO,,0.1961036
SYSHDHTGNLTNR,ph,T,198,false,"atm callus - FC atm vs. atm Xray",111c,31410901,,58.5400000,,2.2950289,0.0000000,NO,,0.1961036
SYSHDHTGNLTNR,ph,T,198,false,"atm-3 X-ray callus - FC atm vs. atm Xray",111d,31410901,,58.5400000,,2.2950289,0.0000000,NO,,0.1961036
SYSHDHTGNLTNR,ph,T,198,false,"Tissue atlas Arabidopsis - ProteomicsDB",114,32188942,"MaxQuant score",240.5300000,1.0000000,,,,0,
SLPTYESSHEFQTK,ph,S,342,false,"Tissue atlas Arabidopsis - ProteomicsDB",114,32188942,"MaxQuant score",80.3870000,0.8002030,,,,0.00047584599815309,
