Peptide,PTM,ModifiedAA,ModifiedPosition,PeptideUniqueToGene,ExperimentDesc,ExpID,PubmedID,ScoreType,IdentScore,LocProb,Log2FChange,PQ-val,QuantSig,PEP,MassErrorPPM
GGSIDYSMDFSK,ph,S,27,true,"atm and atr DNA damage response",88,25561503,"MASCOT Score",52.0000000,1.0000000,,,,,0.2400000
GGSIDYSMDFSK,ph,S,27,true,"Tissue atlas Arabidopsis - ProteomicsDB",114,32188942,"MaxQuant score",83.5300000,0.9999990,,,,0.00021172300330363,
GGSIDYSMDFSK,ph,S,31,true,"TOR Kinase and ABA Receptor",100,29290610,XCorr,3.7696640,0.9999000,,,,1.918999987538E-5,
GGSIDYSMDFSK,ph,S,31,true,"Tissue atlas Arabidopsis - ProteomicsDB",114,32188942,"MaxQuant score",149.5700000,0.9999870,,,,1.9732000566819E-7,
DASRASLGNEEELINPFHDQPPVDTAKPK,ph,S,49,true,"Tissue atlas Arabidopsis - ProteomicsDB",114,32188942,"MaxQuant score",176.0800000,1.0000000,,,,0,
DASRASLGNEEELINPFHDQPPVDTAKPK,ph,S,52,true,"Phosphoproteome ethylene-regulated time response",46,24043427,"MASCOT Score",52.3100000,,,,,,-0.5524800
DASRASLGNEEELINPFHDQPPVDTAKPK,ph,S,52,true,"Protein sumoylation and phosphorylation cross-talk",97,28419593,,,,,,,,
DASRASLGNEEELINPFHDQPPVDTAKPK,ph,S,52,true,"Tissue atlas Arabidopsis - ProteomicsDB",114,32188942,"MaxQuant score",247.5200000,1.0000000,,,,0,
ASLGNEEELINPFHDQPPVDTAKPK,ph,S,52,true,"Phosphorylation Early Elicitor Signaling",23,17317660,,,,,,,,
ASLGNEEELINPFHDQPPVDTAKPK,ph,S,52,true,"Large-scale phosphorylation discovery",44,23111157,XCorr,5.9580000,,,,,,
ASLGNEEELINPFHDQPPVDTAKPK,ph,T,71,true,"Large-scale phosphorylation discovery",44,23111157,XCorr,3.4150000,,,,,,
KLTTVHSDNNNR,ph,S,82,true,"STN8 phosphoproteome",38,21768351,"MASCOT Score",46.9200000,,,,,,-1.4796600
KLTTVHSDNNNR,ph,S,82,true,"Chloroplast kinase substrates",60,19376835,"MASCOT Score",41.9900000,,,,,,-1.4796600
KLTTVHSDNNNR,ph,S,82,true,"atm and atr DNA damage response",88,25561503,"MASCOT Score",40.0000000,1.0000000,,,,,0.0100000
KLTTVHSDNNNR,ph,S,82,true,"TOR Kinase and ABA Receptor",100,29290610,XCorr,2.9299197,0.9999000,,,,0.012009999714792,
LTTVHSDNNNR,ph,S,82,true,"Large-scale phosphorylation discovery",44,23111157,XCorr,3.3720000,,,,,,
LTTVHSDNNNR,ph,S,82,true,"atm and atr DNA damage response",88,25561503,"MASCOT Score",49.0000000,1.0000000,,,,,0.3400000
LTTVHSDNNNR,ph,S,82,true,"Tissue atlas Arabidopsis - ProteomicsDB",114,32188942,"MaxQuant score",205.8600000,0.9999990,,,,1.6999899259402E-24,
NEFSHHHPHSPSR,ph,S,97,true,"TOR Kinase and ABA Receptor",100,29290610,XCorr,2.8734820,0.9674000,,,,0.0098090004175901,
NEFSHHHPHSPSR,ph,S,97,true,"Tissue atlas Arabidopsis - ProteomicsDB",114,32188942,"MaxQuant score",145.4800000,0.9917780,,,,3.2644499015078E-7,
