Peptide,PTM,ModifiedAA,ModifiedPosition,PeptideUniqueToGene,ExperimentDesc,ExpID,PubmedID,ScoreType,IdentScore,LocProb,Log2FChange,PQ-val,QuantSig,PEP,MassErrorPPM
MNTGGRLIAGSHNRNE,nta,M,1,false,"Arg/N-end rule seed, prt6 vs. Wt",99,29168982,"MASCOT Score",32.1000000,,,,,1.8610000552144E-5,-0.0706464
MNTGGRLIAGSHNRNE,nta,M,1,false,"HUNTER N-terminome: legumain, GluC and trypsin",119,31951383,"MaxQuant score",110.7400000,,,,,,
LIAGSHNR,ph,S,11,false,"atm and atr DNA damage response",88,25561503,"MASCOT Score",41.0000000,1.0000000,,,,,-0.5000000
IRSVQELSGQTCQICR,ph,S,30,true,"Tissue atlas Arabidopsis - ProteomicsDB",114,32188942,"MaxQuant score",114.2700000,0.9999970,,,,5.1615899110402E-8,
RNSGFPQSDLDSAPPGSQIPLLTYGDEDVEISSDR,ph,S,136,true,"TOR Kinase and ABA Receptor",100,29290610,XCorr,3.7832479,0.8524000,,,,0.021040000021458,
HALIVPPSLGGHGNR,ph,S,176,true,"Tissue atlas Arabidopsis - ProteomicsDB",114,32188942,"MaxQuant score",84.0350000,1.0000000,,,,4.7980400267988E-5,
KQNEKLQVVR,ub,K,227,true,"Ubiquitination Membrane Proteins",120,33585938,,,,,,,,
KQNEKLQVVR,ub,K,231,true,"Ubiquitination Membrane Proteins",120,33585938,,,,,,,,
NKVHPAFVR,ub,K,444,false,"Ubiquitination Membrane Proteins",120,33585938,,,,,,,,
NKVHPAFVR,ub,K,444,false,"upl3 mutant / wildtype",168,35926874,"MaxQuant score",50.0400000,1.0000000,0.2654369,,,0.017961399629712,-0.0346000
INALVATAQKVPEDGWTMQDGTPWPGNSVR,ub,K,476,true,"upl3 mutant / wildtype",168,35926874,"MaxQuant score",71.6700000,1.0000000,0.8439838,0.1676210,NO,1.1709799796478E-10,-0.8546500
KTCNCWPK,acy,C,658,false,"Arabidopsis S-acylation atlas - Meristem",163a,35681017,,,,,,,,
TCNCWPK,acy,C,658,false,"Arabidopsis S-acylation atlas - Meristem",163a,35681017,,,,,,,,
KTCNCWPK,acy,C,660,false,"Arabidopsis S-acylation atlas - Meristem",163a,35681017,,,,,,,,
TCNCWPK,acy,C,660,false,"Arabidopsis S-acylation atlas - Meristem",163a,35681017,,,,,,,,
NASPACLLK,sno,C,752,true,"hot5-4 / wildtype, FAT-switch S-nitrosoproteome",169,37277371,,,,0.2160415,0.0315491,NO,,
SVYCTPK,sno,C,802,false,"hot5-4 / wildtype, FAT-switch S-nitrosoproteome",169,37277371,,,,,,,,
GGPILEICGLDCL,sno,C,1079,false,"hot5-4 / wildtype, FAT-switch S-nitrosoproteome",169,37277371,,,,0.0887105,0.6154647,NO,,
