Peptide,PTM,ModifiedAA,ModifiedPosition,PeptideUniqueToGene,ExperimentDesc,ExpID,PubmedID,ScoreType,IdentScore,LocProb,Log2FChange,PQ-val,QuantSig,PEP,MassErrorPPM
MWESESDGGVGVGGGGGR,nt,M,2,true,"Arg/N-end rule seed, prt6 vs. Wt",99,29168982,"MASCOT Score",85.8100000,,,,,0.00011890000314452,-0.6201845
MWESESDGGVGVGGGGGR,nta,M,2,true,"Arg/N-end rule seed, prt6 vs. Wt",99,29168982,"MASCOT Score",85.8100000,,,,,0.00011890000314452,-0.6201845
MWESESDGGVGVGGGGGR,nta,M,2,true,"HUNTER N-terminome: legumain, GluC and trypsin",119,31951383,"MaxQuant score",70.4120000,,,,,,
MWESESDGGVGVGGGGGR,ph,S,7,true,"Tissue atlas Arabidopsis - ProteomicsDB",114,32188942,"MaxQuant score",116.0600000,0.9975260,,,,1.0586999956771E-16,
APSPSTTNFAGSSPR,ph,S,213,true,"SnRK2 protein kinase substrates",85,23776212,XCorr,2.2456946,0.9840000,,,,0.030692199245095,
APSPSTTNFAGSSPR,ph,S,213,true,"atm and atr DNA damage response",88,25561503,"MASCOT Score",45.0000000,0.9940000,,,,,1.3400000
APSPSTTNFAGSSPR,ph,S,213,true,"Phosphorylation tonoplast membrane fraction",107,18686298,"MASCOT Score",51.0000000,,,,,,
APSPSTTNFAGSSPR,ph,S,213,true,"Tissue atlas Arabidopsis - ProteomicsDB",114,32188942,"MaxQuant score",251.4200000,0.9999040,,,,0,
APSPSTTNFAGSSPR,ph,S,215,true,"SIRK1 phosphorylation",86a,23820729,"MaxQuant Score",74.7310000,0.8840000,,,,1.0230000019073,8.0590000
APSPSTTNFAGSSPR,ph,S,215,true,"TOR Kinase and ABA Receptor",100,29290610,XCorr,5.0809002,0.8710000,,,,0.00010050000128103,
APSPSTTNFAGSSPR,ph,S,215,true,"Lateral root-induction - NAA vs control",106,23328941,"MASCOT Score",24.0000000,,,,,,
APSPSTTNFAGSSPR,ph,S,215,true,"Tissue atlas Arabidopsis - ProteomicsDB",114,32188942,"MaxQuant score",236.4300000,0.9956120,,,,0,
APSPSTTNFAGSSPR,ph,T,216,true,"atm and atr DNA damage response",88,25561503,"MASCOT Score",36.0000000,0.8790000,,,,,0.3400000
APSPSTTNFAGSSPR,ph,T,217,true,"Lateral root-induction - NAA vs control",106,23328941,"MASCOT Score",24.0000000,,,,,,
APSPSTTNFAGSSPR,ph,S,222,true,"SIRK1 phosphorylation",86a,23820729,"MaxQuant Score",104.5500000,0.8980000,,,,0.18600000441074,2.0100000
APSPSTTNFAGSSPR,ph,S,222,true,"SIRK1 exp - sirk1 mutant vs WT",86b,23820729,,,,-1.6822122,,NO,,
APSPSTTNFAGSSPR,ph,S,222,true,"SIRK1 exp - 35S:SIRK1 vs WT",86c,23820729,,,,0.4746698,,NO,,
APSPSTTNFAGSSPR,ph,S,222,true,"Lateral root-induction - NAA vs control",106,23328941,"MASCOT Score",31.0000000,,,,,,
APSPSTTNFAGSSPR,ph,S,222,true,"Phosphorylation tonoplast membrane fraction",107,18686298,"MASCOT Score",51.0000000,,,,,,
APSPSTTNFAGSSPR,ph,S,222,true,"Tissue atlas Arabidopsis - ProteomicsDB",114,32188942,"MaxQuant score",294.5200000,0.8250230,,,,0,
APSPSTTNFAGSSPR,ph,S,223,true,"Large-scale phosphorylation discovery",44,23111157,XCorr,3.4190000,,,,,,
APSPSTTNFAGSSPR,ph,S,223,true,"srk2dei ABA signaling phopshoproteomics",83,23572148,"MASCOT Score",82.0000000,,,,,,-0.0005000
APSPSTTNFAGSSPR,ph,S,223,true,"LAXIC - ABA stress",84a,23660473,XCorr,4.9100000,0.9980000,,,,0.00015598699974362,
APSPSTTNFAGSSPR,ph,S,223,true,"LAXIC - mannitol vs control",84b,23660473,XCorr,3.7700000,0.9980000,-1.3925712,,NO,5.1099998798348E-13,
APSPSTTNFAGSSPR,ph,S,223,true,"SnRK2 protein kinase substrates",85,23776212,XCorr,4.0482583,0.9990000,,,,1.0946300289805E-11,
APSPSTTNFAGSSPR,ph,S,223,true,"SIRK1 phosphorylation",86a,23820729,"MaxQuant Score",96.6830000,0.7820000,,,,0.358000010252,8.2060000
APSPSTTNFAGSSPR,ph,S,223,true,"atm and atr DNA damage response",88,25561503,"MASCOT Score",73.0000000,0.9980000,,,,,-0.5900000
APSPSTTNFAGSSPR,ph,S,223,true,"TOR Kinase and ABA Receptor",100,29290610,XCorr,5.3290672,0.9883000,,,,1.4830000338861E-8,
APSPSTTNFAGSSPR,ph,S,223,true,"Lateral root-induction - NAA vs control",106,23328941,"MASCOT Score",43.0000000,,,,,,
APSPSTTNFAGSSPR,ph,S,223,true,"Phosphorylation tonoplast membrane fraction",107,18686298,"MASCOT Score",75.0000000,,,,,,
APSPSTTNFAGSSPR,ph,S,223,true,"Col-0 callus - FC Col-0 vs. Col-0 Xray",111a,31410901,,85.0100000,,0.4330802,0.0000000,NO,,1.0148684
APSPSTTNFAGSSPR,ph,S,223,true,"Col-0 X-ray callus - FC Col-0 vs. Col-0 Xray",111b,31410901,,85.0100000,,0.4330802,0.0000000,NO,,1.0148684
APSPSTTNFAGSSPR,ph,S,223,true,"atm callus - FC atm vs. atm Xray",111c,31410901,,85.0100000,,1.1341379,0.0000000,NO,,1.0148684
APSPSTTNFAGSSPR,ph,S,223,true,"atm-3 X-ray callus - FC atm vs. atm Xray",111d,31410901,,85.0100000,,1.1341379,0.0000000,NO,,1.0148684
APSPSTTNFAGSSPR,ph,S,223,true,"Tissue atlas Arabidopsis - ProteomicsDB",114,32188942,"MaxQuant score",326.0500000,0.9801450,,,,0,
DSSFYCSPSR,ph,S,237,true,"STN8 phosphoproteome",38,21768351,"MASCOT Score",51.9000000,,,,,,
DSSFYCSPSR,ph,S,237,true,"Large-scale phosphorylation discovery",44,23111157,XCorr,3.5230000,,,,,,
DSSFYCSPSR,ph,S,237,true,"Chloroplast kinase substrates",60,19376835,"MASCOT Score",34.5300000,,,,,,0.8656430
DSSFYCSPSR,ph,S,237,true,"srk2dei ABA signaling phopshoproteomics",83,23572148,"MASCOT Score",50.0000000,,,,,,-0.0003000
DSSFYCSPSR,ph,S,237,true,"atm and atr DNA damage response",88,25561503,"MASCOT Score",35.0000000,1.0000000,,,,,0.4900000
DSSFYCSPSR,ph,S,237,true,"TOR Kinase and ABA Receptor",100,29290610,XCorr,2.7881763,0.9252000,,,,0.00050369999371469,
DSSFYCSPSR,ph,S,237,true,"Tissue atlas Arabidopsis - ProteomicsDB",114,32188942,"MaxQuant score",202.6500000,0.9799110,,,,2.4715200275501E-19,
DSSFYCSPSR,ph,S,239,true,"atm and atr DNA damage response",88,25561503,"MASCOT Score",40.0000000,0.9420000,,,,,0.2600000
DSSFYCSPSR,ph,S,239,true,"Tissue atlas Arabidopsis - ProteomicsDB",114,32188942,"MaxQuant score",168.8500000,0.9132250,,,,2.0969700642581E-7,
LLEHFLVQEQTEGSSPSR,ph,T,463,true,"Phosphoproteome ethylene-regulated time response",46,24043427,"MASCOT Score",44.4600000,,,,,,-9.9758000
LLEHFLVQEQTEGSSPSR,ph,S,466,true,"MAPK Arabidopsis substrates",45,23172892,"MaxQuant Score",74.7720000,,,,,,
LLEHFLVQEQTEGSSPSR,ph,S,466,true,"Tissue atlas Arabidopsis - ProteomicsDB",114,32188942,"MaxQuant score",240.4200000,0.8282510,,,,0,
LLEHFLVQEQTEGSSPSR,ph,S,467,true,"Large-scale phosphorylation discovery",44,23111157,XCorr,5.2680000,,,,,,
LLEHFLVQEQTEGSSPSR,ph,S,467,true,"MAPK Arabidopsis substrates",45,23172892,"MaxQuant Score",117.2900000,,,,,,
LLEHFLVQEQTEGSSPSR,ph,S,467,true,"srk2dei ABA signaling phopshoproteomics",83,23572148,"MASCOT Score",33.0000000,,,,,,0.0037000
LLEHFLVQEQTEGSSPSR,ph,S,467,true,"SnRK2 protein kinase substrates",85,23776212,XCorr,2.9440393,0.7980000,,,,0.00024753200705163,
LLEHFLVQEQTEGSSPSR,ph,S,467,true,"Col-0 callus - FC Col-0 vs. Col-0 Xray",111a,31410901,,76.1200000,,0.1198235,0.0000000,NO,,1.3518858
LLEHFLVQEQTEGSSPSR,ph,S,467,true,"Col-0 X-ray callus - FC Col-0 vs. Col-0 Xray",111b,31410901,,76.1200000,,0.1198235,0.0000000,NO,,1.3518858
LLEHFLVQEQTEGSSPSR,ph,S,467,true,"atm callus - FC atm vs. atm Xray",111c,31410901,,76.1200000,,-4.4844344,0.0000000,NO,,1.3518858
LLEHFLVQEQTEGSSPSR,ph,S,467,true,"atm-3 X-ray callus - FC atm vs. atm Xray",111d,31410901,,76.1200000,,-4.4844344,0.0000000,NO,,1.3518858
LLEHFLVQEQTEGSSPSR,ph,S,467,true,"Tissue atlas Arabidopsis - ProteomicsDB",114,32188942,"MaxQuant score",383.3000000,0.9936890,,,,0,
LLEHFLVQEQTEGSSPSR,ph,S,469,true,"LAXIC - ABA stress",84a,23660473,XCorr,2.9000000,0.9310000,,,,0.018532499670982,
MSPSPSQSMYADIPR,ph,S,472,true,"atm and atr DNA damage response",88,25561503,"MASCOT Score",65.0000000,1.0000000,,,,,0.2900000
MSPSPSQSMYADIPR,ph,S,472,true,"Tissue atlas Arabidopsis - ProteomicsDB",114,32188942,"MaxQuant score",230.4500000,0.9992630,,,,0,
MSPSPSQSMYADIPR,ph,S,474,true,"Tissue atlas Arabidopsis - ProteomicsDB",114,32188942,"MaxQuant score",184.8300000,0.9999140,,,,7.7136797627749E-26,
MSPSPSQSMYADIPR,ph,S,476,true,"Tissue atlas Arabidopsis - ProteomicsDB",114,32188942,"MaxQuant score",183.3700000,0.9997460,,,,7.9173402291949E-26,
MSGQESHDISSGGEQAGVDHPPPR,ph,S,722,true,"Tissue atlas Arabidopsis - ProteomicsDB",114,32188942,"MaxQuant score",97.3520000,0.9263990,,,,2.8511999860329E-16,
MSGQESHDISSGGEQAGVDHPPPR,ph,S,723,true,"atm and atr DNA damage response",88,25561503,"MASCOT Score",36.0000000,0.9230000,,,,,-0.4900000
MSGQESHDISSGGEQAGVDHPPPR,ph,S,723,true,"TOR Kinase and ABA Receptor",100,29290610,XCorr,4.7160077,0.7691000,,,,2.3120001060306E-6,
MSGQESHDISSGGEQAGVDHPPPR,ph,S,723,true,"Tissue atlas Arabidopsis - ProteomicsDB",114,32188942,"MaxQuant score",156.0700000,0.9746610,,,,0,
