Peptide,PTM,ModifiedAA,ModifiedPosition,PeptideUniqueToGene,ExperimentDesc,ExpID,PubmedID,ScoreType,IdentScore,LocProb,Log2FChange,PQ-val,QuantSig,PEP,MassErrorPPM
AAVISREDDLLSFTN,nt,A,57,true,"HUNTER N-terminome: legumain, GluC and trypsin",119,31951383,"MaxQuant score",111.5200000,,,,,,
SLIDDRTEEPLE,nt,S,80,true,"Arg/N-end rule seed, prt6 vs. Wt",99,29168982,"MASCOT Score",34.6400000,,0.1370749,0.6116556,NO,0.00012890000652988,-1.4646000
VHSECLTGDIFGSAR,sno,C,384,false,"Site-specific nitrosomeproteomic id - gsnor1-3",90a,25699590,XCorr,3.8232808,,,,,1.6349999896192E-6,-6.2017821
VHSECLTGDIFGSAR,sno,C,384,false,"Site-specific nitrosomeproteomic id - gsnor1-3",90b,25699590,XCorr,4.2500000,,,,,0.012570000253618,-6.3800000
VHSECLTGDIFGSAR,sno,C,384,false,"hot5-4 / wildtype, FAT-switch S-nitrosoproteome",169,37277371,,,,,,,,
VHSECLTGDIFGSAR,so,C,384,false,"Arabidopsis S-sulfenylation chemoproteomics",108,31578252,"pFind PSM Score",0.1247180,,,,,,-1.4941181
FKGDVVEKIESESES,ph,S,539,true,"SnRK2 protein kinase substrates",85,23776212,XCorr,4.1487894,1.0000000,,,,3.96250006599E-16,
FKGDVVEKIESESES,ph,S,539,true,"Tissue atlas Arabidopsis - ProteomicsDB",114,32188942,"MaxQuant score",221.7900000,0.9998390,,,,0,
GDVVEKIESESES,ph,S,539,true,"Phospho cell culture sucrose/TOR",109,30833711,,,0.9236490,,,,,
