Peptide,PTM,ModifiedAA,ModifiedPosition,PeptideUniqueToGene,ExperimentDesc,ExpID,PubmedID,ScoreType,IdentScore,LocProb,Log2FChange,PQ-val,QuantSig,PEP,MassErrorPPM
SHFGRSGPPDISDTY,nta,S,2,true,"Arabidopsis translation initiation landscape - NTA",167a,35069635,,,,,,,,
SRSASPDEK,ph,S,186,true,"atm and atr DNA damage response",88,25561503,"MASCOT Score",21.0000000,1.0000000,,,,,-0.1900000
SRSASPDEK,ph,S,188,true,"atm and atr DNA damage response",88,25561503,"MASCOT Score",21.0000000,1.0000000,,,,,-0.1900000
SRSASPDEK,ph,S,190,true,"atm and atr DNA damage response",88,25561503,"MASCOT Score",21.0000000,1.0000000,,,,,-0.1900000
SLSASPARRSPR,ph,S,213,true,"Tissue atlas Arabidopsis - ProteomicsDB",114,32188942,"MaxQuant score",65.0300000,1.0000000,,,,0.011919899843633,
SLSASPARR,ph,S,213,true,"Phospho cell culture sucrose/TOR",109,30833711,,,0.9987470,,,,,
SLSASPAR,ph,S,213,true,"atm and atr DNA damage response",88,25561503,"MASCOT Score",31.0000000,1.0000000,,,,,-0.4400000
SLSASPARRSPR,ph,S,215,true,"Tissue atlas Arabidopsis - ProteomicsDB",114,32188942,"MaxQuant score",111.6100000,1.0000000,,,,0.0022438899613917,
SLSASPARR,ph,S,215,true,"Phospho cell culture sucrose/TOR",109,30833711,,,0.9999850,,,,,
SLSASPAR,ph,S,215,true,"atm and atr DNA damage response",88,25561503,"MASCOT Score",31.0000000,1.0000000,,,,,-0.4400000
SLSASPARRSPR,ph,S,220,true,"Phospho cell culture sucrose/TOR",109,30833711,,,0.9999750,,,,,
SSSPQKTSPAR,ph,S,225,true,"SnRK2 protein kinase substrates",85,23776212,XCorr,2.1734085,0.8830000,,,,0.15645000338554,
SSSPQKTSPAR,ph,S,230,true,"SnRK2 protein kinase substrates",85,23776212,XCorr,2.1734085,0.9370000,,,,0.15645000338554,
RSLSPRSPALQK,ph,S,251,true,"Large-scale phosphorylation discovery",44,23111157,XCorr,3.5130000,,,,,,
RSLSPRSPALQK,ph,S,251,true,"SnRK2 protein kinase substrates",85,23776212,XCorr,3.0967050,1.0000000,,,,0.036617398262024,
RSLSPRSPALQK,ph,S,251,true,"atm and atr DNA damage response",88,25561503,"MASCOT Score",30.0000000,1.0000000,,,,,-0.2900000
SLSPRSPALQK,ph,S,251,true,"atm and atr DNA damage response",88,25561503,"MASCOT Score",34.0000000,1.0000000,,,,,-1.0700000
SLSPRSPALQK,ph,S,251,true,"Phospho cell culture sucrose/TOR",109,30833711,,,1.0000000,,,,,
SLSPRSPALQK,ph,S,251,true,"Tissue atlas Arabidopsis - ProteomicsDB",114,32188942,"MaxQuant score",126.2600000,1.0000000,,,,2.2290500055533E-5,
RSLSPR,ph,S,251,false,"Col-0 callus - FC Col-0 vs. Col-0 Xray",111a,31410901,,22.5100000,,0.1071029,0.0000000,NO,,0.1407015
RSLSPR,ph,S,251,false,"Col-0 X-ray callus - FC Col-0 vs. Col-0 Xray",111b,31410901,,22.5100000,,0.1071029,0.0000000,NO,,0.1407015
RSLSPR,ph,S,251,false,"atm callus - FC atm vs. atm Xray",111c,31410901,,22.5100000,,-0.9152461,0.0000000,NO,,0.1407015
RSLSPR,ph,S,251,false,"atm-3 X-ray callus - FC atm vs. atm Xray",111d,31410901,,22.5100000,,-0.9152461,0.0000000,NO,,0.1407015
RSLSPRSPALQK,ph,S,253,true,"Large-scale phosphorylation discovery",44,23111157,XCorr,3.5130000,,,,,,
RSLSPRSPALQK,ph,S,253,true,"SnRK2 protein kinase substrates",85,23776212,XCorr,3.0967050,1.0000000,,,,0.036617398262024,
RSLSPRSPALQK,ph,S,253,true,"atm and atr DNA damage response",88,25561503,"MASCOT Score",30.0000000,1.0000000,,,,,-0.2900000
SLSPRSPALQK,ph,S,253,true,"atm and atr DNA damage response",88,25561503,"MASCOT Score",34.0000000,1.0000000,,,,,-1.0700000
SLSPRSPALQK,ph,S,253,true,"Tissue atlas Arabidopsis - ProteomicsDB",114,32188942,"MaxQuant score",126.2600000,1.0000000,,,,2.2290500055533E-5,
RSLSPR,ph,S,253,false,"Col-0 callus - FC Col-0 vs. Col-0 Xray",111a,31410901,,22.5100000,,0.1071029,0.0000000,NO,,0.1407015
RSLSPR,ph,S,253,false,"Col-0 X-ray callus - FC Col-0 vs. Col-0 Xray",111b,31410901,,22.5100000,,0.1071029,0.0000000,NO,,0.1407015
RSLSPR,ph,S,253,false,"atm callus - FC atm vs. atm Xray",111c,31410901,,22.5100000,,-0.9152461,0.0000000,NO,,0.1407015
RSLSPR,ph,S,253,false,"atm-3 X-ray callus - FC atm vs. atm Xray",111d,31410901,,22.5100000,,-0.9152461,0.0000000,NO,,0.1407015
RSLSPRSPALQK,ph,S,256,true,"Large-scale phosphorylation discovery",44,23111157,XCorr,3.5130000,,,,,,
RSLSPRSPALQK,ph,S,256,true,"SnRK2 protein kinase substrates",85,23776212,XCorr,3.0967050,1.0000000,,,,0.036617398262024,
RSLSPRSPALQK,ph,S,256,true,"atm and atr DNA damage response",88,25561503,"MASCOT Score",30.0000000,1.0000000,,,,,-0.2900000
SPALQKASPSK,ph,S,256,true,"Chloroplast kinase substrates",60,19376835,"MASCOT Score",38.6700000,,,,,,-1.6730300
SPALQKASPSK,ph,S,256,true,"SnRK2 protein kinase substrates",85,23776212,XCorr,2.1403618,1.0000000,,,,0.10910700261593,
SPALQKASPSK,ph,S,256,true,"Tissue atlas Arabidopsis - ProteomicsDB",114,32188942,"MaxQuant score",126.2600000,1.0000000,,,,2.2290500055533E-5,
SLSPRSPALQK,ph,S,256,true,"atm and atr DNA damage response",88,25561503,"MASCOT Score",34.0000000,1.0000000,,,,,-1.0700000
ASPSKEMSPERR,ph,S,263,true,"SnRK2 protein kinase substrates",85,23776212,XCorr,2.4053304,0.8720000,,,,0.08262550085783,
ASPSKEMSPERR,ph,S,263,true,"atm and atr DNA damage response",88,25561503,"MASCOT Score",30.0000000,1.0000000,,,,,-0.9100000
ASPSKEMSPERR,ph,S,263,true,"Phospho cell culture sucrose/TOR",109,30833711,,,0.9996330,,,,,
ASPSKEMSPERR,ph,S,263,true,"Tissue atlas Arabidopsis - ProteomicsDB",114,32188942,"MaxQuant score",113.6700000,1.0000000,,,,2.3883500034572E-5,
SPALQKASPSK,ph,S,263,true,"Chloroplast kinase substrates",60,19376835,"MASCOT Score",38.6700000,,,,,,-1.6730300
SPALQKASPSK,ph,S,263,true,"SnRK2 protein kinase substrates",85,23776212,XCorr,2.1403618,0.9880000,,,,0.10910700261593,
ASPSKEMSPER,ph,S,263,true,"atm and atr DNA damage response",88,25561503,"MASCOT Score",34.0000000,1.0000000,,,,,-0.6300000
ASPSKEMSPERR,ph,S,269,true,"SnRK2 protein kinase substrates",85,23776212,XCorr,2.4053304,0.9760000,,,,0.08262550085783,
ASPSKEMSPERR,ph,S,269,true,"atm and atr DNA damage response",88,25561503,"MASCOT Score",30.0000000,1.0000000,,,,,-0.9100000
ASPSKEMSPER,ph,S,269,true,"atm and atr DNA damage response",88,25561503,"MASCOT Score",34.0000000,1.0000000,,,,,-0.6300000
EMSPERR,ph,S,269,true,"Phospho cell culture sucrose/TOR",109,30833711,,,1.0000000,,,,,
EMSPERR,ph,S,269,true,"Tissue atlas Arabidopsis - ProteomicsDB",114,32188942,"MaxQuant score",101.3000000,1.0000000,,,,5.8793400967261E-5,
SNERSPSPGSPAPLRK,ph,S,274,true,"srk2dei ABA signaling phopshoproteomics",83,23572148,"MASCOT Score",31.0000000,,,,,,0.0010000
SNERSPSPGSPAPLRK,ph,S,274,true,"Phospho cell culture sucrose/TOR",109,30833711,,,1.0000000,,,,,
SNERSPSPGSPAPLRK,ph,S,274,true,"Tissue atlas Arabidopsis - ProteomicsDB",114,32188942,"MaxQuant score",194.2500000,1.0000000,,,,5.9554624214419E-40,
SNERSPSPGSPAPLR,ph,S,274,true,"atm and atr DNA damage response",88,25561503,"MASCOT Score",31.0000000,1.0000000,,,,,-0.1200000
SNERSPSPGSPAPLR,ph,S,274,true,"Col-0 callus - FC Col-0 vs. Col-0 Xray",111a,31410901,,31.5400000,,3.0109003,0.0000000,NO,,0.8159838
SNERSPSPGSPAPLR,ph,S,274,true,"Col-0 X-ray callus - FC Col-0 vs. Col-0 Xray",111b,31410901,,31.5400000,,3.0109003,0.0000000,NO,,0.8159838
SNERSPSPGSPAPLR,ph,S,274,true,"atm callus - FC atm vs. atm Xray",111c,31410901,,31.5400000,,1.1181061,0.0000000,NO,,0.8159838
SNERSPSPGSPAPLR,ph,S,274,true,"atm-3 X-ray callus - FC atm vs. atm Xray",111d,31410901,,31.5400000,,1.1181061,0.0000000,NO,,0.8159838
SNERSPSPGSPAPLRK,ph,S,278,true,"srk2dei ABA signaling phopshoproteomics",83,23572148,"MASCOT Score",30.0000000,,,,,,-0.0009000
SNERSPSPGSPAPLRK,ph,S,278,true,"TOR Kinase and ABA Receptor",100,29290610,XCorr,3.6299877,0.9776000,,,,0.0011749999830499,
SNERSPSPGSPAPLR,ph,S,278,true,"Phosphorylation RNA metabolism",22,16807317,,,,,,,,
SNERSPSPGSPAPLR,ph,S,278,true,"atm and atr DNA damage response",88,25561503,"MASCOT Score",38.0000000,1.0000000,,,,,-0.0500000
SNERSPSPGSPAPLR,ph,S,278,true,"Col-0 callus - FC Col-0 vs. Col-0 Xray",111a,31410901,,31.5400000,,3.0109003,0.0000000,NO,,0.8159838
SNERSPSPGSPAPLR,ph,S,278,true,"Col-0 X-ray callus - FC Col-0 vs. Col-0 Xray",111b,31410901,,31.5400000,,3.0109003,0.0000000,NO,,0.8159838
SNERSPSPGSPAPLR,ph,S,278,true,"atm callus - FC atm vs. atm Xray",111c,31410901,,31.5400000,,1.1181061,0.0000000,NO,,0.8159838
SNERSPSPGSPAPLR,ph,S,278,true,"atm-3 X-ray callus - FC atm vs. atm Xray",111d,31410901,,31.5400000,,1.1181061,0.0000000,NO,,0.8159838
SPSPGSPAPLR,ph,S,278,true,"Tissue atlas Arabidopsis - ProteomicsDB",114,32188942,"MaxQuant score",194.2500000,1.0000000,,,,5.9554624214419E-40,
SNERSPSPGSPAPLRK,ph,S,280,true,"srk2dei ABA signaling phopshoproteomics",83,23572148,"MASCOT Score",31.0000000,,,,,,0.0010000
SNERSPSPGSPAPLRK,ph,S,280,true,"TOR Kinase and ABA Receptor",100,29290610,XCorr,3.6299877,0.9998000,,,,0.0011749999830499,
SNERSPSPGSPAPLR,ph,S,280,true,"Phosphorylation RNA metabolism",22,16807317,,,,,,,,
SNERSPSPGSPAPLR,ph,S,280,true,"atm and atr DNA damage response",88,25561503,"MASCOT Score",38.0000000,1.0000000,,,,,-0.0500000
SNERSPSPGSPAPLR,ph,S,280,true,"Col-0 callus - FC Col-0 vs. Col-0 Xray",111a,31410901,,31.5400000,,3.0109003,0.0000000,NO,,0.8159838
SNERSPSPGSPAPLR,ph,S,280,true,"Col-0 X-ray callus - FC Col-0 vs. Col-0 Xray",111b,31410901,,31.5400000,,3.0109003,0.0000000,NO,,0.8159838
SNERSPSPGSPAPLR,ph,S,280,true,"atm callus - FC atm vs. atm Xray",111c,31410901,,31.5400000,,1.1181061,0.0000000,NO,,0.8159838
SNERSPSPGSPAPLR,ph,S,280,true,"atm-3 X-ray callus - FC atm vs. atm Xray",111d,31410901,,31.5400000,,1.1181061,0.0000000,NO,,0.8159838
SPSPGSPAPLR,ph,S,280,true,"Tissue atlas Arabidopsis - ProteomicsDB",114,32188942,"MaxQuant score",194.2500000,1.0000000,,,,5.9554624214419E-40,
SNERSPSPGSPAPLRK,ph,S,283,true,"srk2dei ABA signaling phopshoproteomics",83,23572148,"MASCOT Score",31.0000000,,,,,,0.0010000
SNERSPSPGSPAPLRK,ph,S,283,true,"TOR Kinase and ABA Receptor",100,29290610,XCorr,3.6299877,1.0000000,,,,0.0011749999830499,
SNERSPSPGSPAPLR,ph,S,283,true,"Phosphorylation RNA metabolism",22,16807317,,,,,,,,
SNERSPSPGSPAPLR,ph,S,283,true,"atm and atr DNA damage response",88,25561503,"MASCOT Score",38.0000000,1.0000000,,,,,-0.0500000
SNERSPSPGSPAPLR,ph,S,283,true,"Col-0 callus - FC Col-0 vs. Col-0 Xray",111a,31410901,,31.5400000,,3.0109003,0.0000000,NO,,0.8159838
SNERSPSPGSPAPLR,ph,S,283,true,"Col-0 X-ray callus - FC Col-0 vs. Col-0 Xray",111b,31410901,,31.5400000,,3.0109003,0.0000000,NO,,0.8159838
SNERSPSPGSPAPLR,ph,S,283,true,"atm callus - FC atm vs. atm Xray",111c,31410901,,31.5400000,,1.1181061,0.0000000,NO,,0.8159838
SNERSPSPGSPAPLR,ph,S,283,true,"atm-3 X-ray callus - FC atm vs. atm Xray",111d,31410901,,31.5400000,,1.1181061,0.0000000,NO,,0.8159838
SPSPGSPAPLR,ph,S,283,true,"Tissue atlas Arabidopsis - ProteomicsDB",114,32188942,"MaxQuant score",194.2500000,1.0000000,,,,5.9554624214419E-40,
KVDAASRSQSPYAAE,ph,S,294,true,"srk2dei ABA signaling phopshoproteomics",83,23572148,"MASCOT Score",38.0000000,,,,,,-0.0017000
KVDAASRSQSPYAAE,ph,S,294,true,"SnRK2 protein kinase substrates",85,23776212,XCorr,2.7366717,1.0000000,,,,2.7334199330653E-5,
KVDAASRSQSPYAAE,ph,S,294,true,"atm and atr DNA damage response",88,25561503,"MASCOT Score",27.0000000,1.0000000,,,,,-0.2700000
KVDAASRSQSPYAAE,ph,S,294,true,"Tissue atlas Arabidopsis - ProteomicsDB",114,32188942,"MaxQuant score",139.7800000,1.0000000,,,,1.1492599938372E-16,
VDAASRSQSPYAAE,ph,S,294,true,"atm and atr DNA damage response",88,25561503,"MASCOT Score",31.0000000,1.0000000,,,,,1.1000000
VDAASRSQSPYAAE,ph,S,294,true,"Phospho cell culture sucrose/TOR",109,30833711,,,0.9971480,,,,,
KVDAASRSQSPYAAE,ph,S,296,true,"Phosphorylation RNA metabolism",22,16807317,,,,,,,,
KVDAASRSQSPYAAE,ph,S,296,true,"srk2dei ABA signaling phopshoproteomics",83,23572148,"MASCOT Score",38.0000000,,,,,,-0.0017000
KVDAASRSQSPYAAE,ph,S,296,true,"SnRK2 protein kinase substrates",85,23776212,XCorr,2.7366717,1.0000000,,,,2.7334199330653E-5,
KVDAASRSQSPYAAE,ph,S,296,true,"atm and atr DNA damage response",88,25561503,"MASCOT Score",29.0000000,0.9360000,,,,,0.1500000
KVDAASRSQSPYAAE,ph,S,296,true,"Tissue atlas Arabidopsis - ProteomicsDB",114,32188942,"MaxQuant score",139.7800000,0.9999980,,,,1.1492599938372E-16,
VDAASRSQSPYAAE,ph,S,296,true,"Conserved plant phosphoproteome - Arabidopsis",61a,20466843,"MASCOT Score",27.0000000,1.0000000,,,,,
VDAASRSQSPYAAE,ph,S,296,true,"srk2dei ABA signaling phopshoproteomics",83,23572148,"MASCOT Score",25.0000000,,,,,,-0.0013000
VDAASRSQSPYAAE,ph,S,296,true,"atm and atr DNA damage response",88,25561503,"MASCOT Score",47.0000000,1.0000000,,,,,0.1200000
VDAASRSQSPYAAE,ph,S,296,true,"TOR Kinase and ABA Receptor",100,29290610,XCorr,3.6304543,0.9956000,,,,0.00024419999681413,
KVDAASRSQSPYAAE,ph,S,298,true,"Phosphorylation RNA metabolism",22,16807317,,,,,,,,
KVDAASRSQSPYAAE,ph,S,298,true,"srk2dei ABA signaling phopshoproteomics",83,23572148,"MASCOT Score",38.0000000,,,,,,-0.0017000
KVDAASRSQSPYAAE,ph,S,298,true,"SnRK2 protein kinase substrates",85,23776212,XCorr,2.7366717,0.9940000,,,,2.7334199330653E-5,
KVDAASRSQSPYAAE,ph,S,298,true,"atm and atr DNA damage response",88,25561503,"MASCOT Score",29.0000000,0.9360000,,,,,0.1500000
KVDAASRSQSPYAAE,ph,S,298,true,"Tissue atlas Arabidopsis - ProteomicsDB",114,32188942,"MaxQuant score",139.7800000,0.9999230,,,,1.1492599938372E-16,
VDAASRSQSPYAAE,ph,S,298,true,"Conserved plant phosphoproteome - Arabidopsis",61a,20466843,"MASCOT Score",27.0000000,1.0000000,,,,,
VDAASRSQSPYAAE,ph,S,298,true,"srk2dei ABA signaling phopshoproteomics",83,23572148,"MASCOT Score",26.0000000,,,,,,-0.0016000
VDAASRSQSPYAAE,ph,S,298,true,"atm and atr DNA damage response",88,25561503,"MASCOT Score",47.0000000,0.9960000,,,,,0.1200000
VDAASRSQSPYAAE,ph,S,298,true,"TOR Kinase and ABA Receptor",100,29290610,XCorr,3.6304543,0.8932000,,,,0.00024419999681413,
VDAASRSQSPYAAE,ph,S,298,true,"Phospho cell culture sucrose/TOR",109,30833711,,,0.9765580,,,,,
VDAASRSQSPYAAE,ph,Y,300,true,"srk2dei ABA signaling phopshoproteomics",83,23572148,"MASCOT Score",26.0000000,,,,,,-0.0016000
