Peptide,PTM,ModifiedAA,ModifiedPosition,PeptideUniqueToGene,ExperimentDesc,ExpID,PubmedID,ScoreType,IdentScore,LocProb,Log2FChange,PQ-val,QuantSig,PEP,MassErrorPPM
SIPANAPGILR,nt,S,63,true,"N-terminal ChaFRADIC",92,26010716,"MASCOT Score",50.6500000,,,,,6.0209998764549E-7,
SIPANAPGILR,nt,S,63,true,"Arg/N-end rule seed, prt6 vs. Wt",99,29168982,"MASCOT Score",33.5000000,,-1.0428277,0.0034703,YES,0.16259999573231,-1.3410152
MHFHDCFVHGCDGSVLLAGNTSER,ng,N,93,true,"Conserved N-glycosylation",74,22633491,"MaxQuant Score",128.6100000,1.0000000,,,,2.8779999099606E-17,-0.0440000
GFEVIEEAKAR,ac,K,115,true,"Quantitative Acetylproteomics",101,29440448,,,,,,,,
TVSCADILTLAAR,sno,C,128,false,"hot5-4 / wildtype, FAT-switch S-nitrosoproteome",169,37277371,,,,-0.3157335,0.0596613,NO,,
ISQASDVNLPGPSDSVAK,ph,S,171,true,"SIRK1 exp - sirk1 mutant vs WT",86b,23820729,,,,-0.8913562,,NO,,
ISQASDVNLPGPSDSVAK,ph,S,171,true,"SIRK1 exp - 35S:SIRK1 vs WT",86c,23820729,,,,-0.5758095,,NO,,
ISQASDVNLPGPSDSVAKQK,ac,K,176,true,"Quantitative Acetylproteomics",101,29440448,,,,,,,,
TLNTLDLVTLVGGHTIGTAGCGLVR,sno,C,205,true,"hot5-4 / wildtype, FAT-switch S-nitrosoproteome",169,37277371,,,,,,,,
FGTEFGKSMVK,ac,K,305,true,"Quantitative Acetylproteomics",101,29440448,,,,,,,,
