Peptide,PTM,ModifiedAA,ModifiedPosition,PeptideUniqueToGene,ExperimentDesc,ExpID,PubmedID,ScoreType,IdentScore,LocProb,Log2FChange,PQ-val,QuantSig,PEP,MassErrorPPM
FAVVACSTPVNNGGSVR,nt,F,39,true,"Mitochondrial intermediate peptidases - icp55 / WT",131a,25732537,,80.4700000,,3.4267840,,,,
AVVACSTPVNNGGSVR,nt,A,40,true,"Arg/N-end rule pathway Roots",80,25728785,"MASCOT Score",65.0300000,,,,,3.9940000533534E-6,
AVVACSTPVNNGGSVR,nt,A,40,true,"Tic56 chloroplast import - tic56-1",89c,25588737,XCorr,3.2794139,,,,,,
AVVACSTPVNNGGSVR,nt,A,40,true,"FtsH12 N-terminome: WT / FtsH12 knockdown miRNA",118,33216923,"MaxQuant score",117.2000000,,,,,0,
AVVACSTPVNNGGSVR,nt,A,40,true,"Mitochondrial intermediate peptidases - oct1-1 / WT",131b,25732537,,94.8300000,,-0.2469338,,,,
AVVACSTPVNNGGSVR,nt,A,40,true,"Mitochondrial intermediate peptidases - oct1-2 / WT",131c,25732537,,80.4800000,,-0.1563961,,,,
AVVACSTPVNNGGSVR,nt,A,40,true,"Arabidopsis translation initiation landscape - NT",167b,35069635,,,,,,,,
STPVNNGGSVR,nt,S,45,true,"Arg/N-end rule seed, prt6 vs. Wt",99,29168982,"MASCOT Score",29.3900000,,0.3388003,0.1366800,NO,0.031860001385212,-0.8963787
FAPSPTGNLHVGGAR,ph,S,61,true,"Tissue atlas Arabidopsis - ProteomicsDB",114,32188942,"MaxQuant score",72.3210000,0.9915180,,,,0.00040002798778005,
SGHVYRCFCSSEE,nt,S,151,true,"N-terminal ChaFRADIC",92,26010716,"MASCOT Score",24.4400000,,,,,1.8689999706112E-5,
EGSLKINDLIR,ac,K,215,true,"Histone deacetylases - apicidin vs control",98a,29061669,"MaxQuant Score",98.9000000,1.0000000,-0.0350000,0.8871560,NO,5.7000002016139E-6,
EGSLKINDLIR,ac,K,215,true,"Histone deacetylases substrates - TSA vs control",98b,29061669,"MaxQuant Score",98.9000000,1.0000000,-0.0280000,0.9977001,NO,5.7000002016139E-6,
EGSLKINDLIR,ac,K,215,true,"Histone deacetylases substrates - hda14 vs WT",98e,29061669,"MaxQuant Score",45.3000000,1.0000000,-0.0160000,0.9772372,NO,0.0080000003799796,
EGSLKINDLIR,ac,K,215,true,"Quantitative Acetylproteomics",101,29440448,,,,,,,,
VNKSGAIFDSTK,ac,K,358,true,"Quantitative Acetylproteomics",101,29440448,,,,,,,,
ALPNEKLTK,ac,K,383,true,"Quantitative Acetylproteomics",101,29440448,,,,,,,,
SYPLHATLASPE,nt,S,432,true,"Arg/N-end rule seed, prt6 vs. Wt",99,29168982,"MASCOT Score",46.5600000,,0.3324339,0.5349371,NO,3.1020001188153E-5,-1.0739571
AFGKSLK,ac,K,488,false,"Quantitative Acetylproteomics",101,29440448,,,,,,,,
GKSLFMPLR,ac,K,495,true,"Quantitative Acetylproteomics",101,29440448,,,,,,,,
