Peptide,PTM,ModifiedAA,ModifiedPosition,PeptideUniqueToGene,ExperimentDesc,ExpID,PubmedID,ScoreType,IdentScore,LocProb,Log2FChange,PQ-val,QuantSig,PEP,MassErrorPPM
VGLVNSSVGFGQK,ng,N,31,true,"Conserved N-glycosylation",74,22633491,"MaxQuant Score",120.4900000,1.0000000,,,,3.3639999674762E-9,-0.3850000
AVSASANAGVIDEYLER,nt,A,79,true,"N-terminal ChaFRADIC",92,26010716,"MASCOT Score",82.0600000,,,,,1.4819999394344E-10,
AVSASANAGVIDEYLE,nt,A,79,true,"N-terminal ChaFRADIC",92,26010716,"MASCOT Score",103.4000000,,,,,5.8739999531099E-9,
NAGVIDEYLER,nt,N,85,true,"N-terminal ChaFRADIC",92,26010716,"MASCOT Score",38.7200000,,,,,1.7779999552658E-6,
AGVIDEYLER,nt,A,86,true,"N-terminal ChaFRADIC",92,26010716,"MASCOT Score",33.3900000,,,,,0.00076979998266324,
AGVIDEYLE,nt,A,86,true,"N-terminal ChaFRADIC",92,26010716,"MASCOT Score",21.2000000,,,,,0.044059999287128,
GVIDEYLERSKTN,nt,G,87,true,"HUNTER N-terminome: legumain, GluC and trypsin",119,31951383,"MaxQuant score",89.6290000,,,,,,
GVIDEYLERS,nt,G,87,true,"N-terminal ChaFRADIC",92,26010716,"MASCOT Score",49.2500000,,,,,0.001083999988623,
GVIDEYLER,nt,G,87,true,"N-terminal ChaFRADIC",92,26010716,"MASCOT Score",42.1800000,,,,,0.00047219998668879,
GVIDEYLER,nt,G,87,true,"Stromal N-terminome",96,26371235,"MASCOT Score",77.6500000,,,,,,
GVIDEYLER,nt,G,87,true,"Arg/N-end rule seed, prt6 vs. Wt",99,29168982,"MASCOT Score",53.8200000,,-1.4514431,0.0000027,YES,0.02441000007093,-1.5792276
GVIDEYLER,nt,G,87,true,"FtsH12 N-terminome: WT / FtsH12 knockdown miRNA",118,33216923,"MaxQuant score",67.1530000,,0.0739804,0.6464889,NO,0.0037444001063704,
GVIDEYLER,nt,G,87,true,"HUNTER N-terminome: legumain, GluC and trypsin",119,31951383,"MaxQuant score",76.8270000,,,,,,
GVIDEYLE,nt,G,87,true,"N-terminal ChaFRADIC",92,26010716,"MASCOT Score",67.6300000,,,,,0.085160002112389,
SKTNKELNDK,ac,K,100,true,"Quantitative Acetylproteomics",101,29440448,,,,,,,,
TNKELNDK,ac,K,100,true,"Quantitative Acetylproteomics",101,29440448,,,,,,,,
SKTNKELNDKKR,ub,K,100,true,"Arabidopsis ubiquitination COFRADIC",40,26744219,"MaxQuant Score",58.3200000,0.9910000,,,,0.003000000026077,0.1440000
ELNDKKR,ac,K,105,true,"Quantitative Acetylproteomics",101,29440448,,,,,,,,
SKTNKELNDKKR,ub,K,105,true,"Arabidopsis ubiquitination COFRADIC",40,26744219,"MaxQuant Score",115.1200000,0.9990000,,,,4.6359999172907E-11,-0.0900000
SKTNKELNDKKR,ub,K,106,true,"Arabidopsis ubiquitination COFRADIC",40,26744219,"MaxQuant Score",115.1200000,1.0000000,,,,4.6359999172907E-11,-0.0900000
AFTVQFGSCK,ph,T,120,true,"Tissue atlas Arabidopsis - ProteomicsDB",114,32188942,"MaxQuant score",117.8600000,1.0000000,,,,0.0004648019967135,
AFTVQFGSCKFPENFTGCQDLAK,ph,S,125,true,"STN8 phosphoproteome",38,21768351,"MASCOT Score",53.6200000,,,,,,
AFTVQFGSCKFPENFTGCQDLAK,ph,S,125,true,"Tissue atlas Arabidopsis - ProteomicsDB",114,32188942,"MaxQuant score",78.3000000,0.9987790,,,,9.5081396978003E-8,
AFTVQFGSCK,ph,S,125,true,"atm and atr DNA damage response",88,25561503,"MASCOT Score",54.0000000,1.0000000,,,,,-0.8300000
AFTVQFGSCK,sno,C,126,true,"hot5-4 / wildtype, FAT-switch S-nitrosoproteome",169,37277371,,,,-1.1056255,0.0000222,YES,,
AFTVQFGSCKFPENFTGCQDLAK,ac,K,127,true,"Histone deacetylases - hda14 vs WT (thylakoids)",98d,29061669,"MaxQuant Score",86.2000000,1.0000000,-0.0380000,0.9954054,NO,1.2700000353119E-14,
FPENFTGCQDLAK,ng,N,131,true,"Conserved N-glycosylation",74,22633491,"MaxQuant Score",128.3000000,1.0000000,,,,8.9330000234775E-20,0.5680000
FPENFTGCQDLAK,sno,C,135,true,"hot5-4 / wildtype, FAT-switch S-nitrosoproteome",169,37277371,,,,-1.1609069,0.0000128,YES,,
FPENFTGCQDLAKQK,ac,K,140,true,"Histone deacetylases - apicidin vs control",98a,29061669,"MaxQuant Score",97.8000000,1.0000000,0.2310000,0.2511886,NO,6.9000001025332E-12,
FPENFTGCQDLAKQK,ac,K,140,true,"Histone deacetylases substrates - TSA vs control",98b,29061669,"MaxQuant Score",97.8000000,1.0000000,-0.0430000,0.9977001,NO,6.9000001025332E-12,
FPENFTGCQDLAKQK,ac,K,140,true,"Histone deacetylases - hda14 vs WT (thylakoids)",98d,29061669,"MaxQuant Score",106.3000000,1.0000000,0.0760000,0.9862795,NO,1.7799999696422E-8,
VPFISEDIALECEGK,sno,C,155,true,"Cold stress nitrosylation - 4°C vs 22°C",65,24388526,,,,,,,,
VPFISEDIALECEGK,sno,C,155,true,"hot5-4 / wildtype, FAT-switch S-nitrosoproteome",169,37277371,,,,-0.7324881,0.0008741,YES,,
CGSNVFWK,acy,C,163,true,"Arabidopsis S-acylation atlas - Leaf",163c,35681017,,,,,,,,
CGSNVFWK,ox,C,163,true,"SPEAR - 10 mM H2O2 / mock",138a,34619326,,,,-0.2315649,0.0473201,YES,,
CGSNVFWK,ox,C,163,true,"SPEAR - 50 mM H2O2 / mock",138b,34619326,,,,-0.1250280,0.0494726,YES,,
