Peptide,PTM,ModifiedAA,ModifiedPosition,PeptideUniqueToGene,ExperimentDesc,ExpID,PubmedID,ScoreType,IdentScore,LocProb,Log2FChange,PQ-val,QuantSig,PEP,MassErrorPPM
SYDYEAPIDEYGLPR,nt,S,316,true,"Tic56 chloroplast import - tic56-1",89c,25588737,XCorr,3.8366647,,,,,,
SYDYEAPIDE,nt,S,316,true,"Arg/N-end rule seed, prt6 vs. Wt",99,29168982,"MASCOT Score",33.6700000,,-1.1016435,0.2785723,NO,0.0078630000352859,-1.1874773
SYDYEAPIDEYGLPR,nta,S,316,true,"FtsH12 N-terminome: WT / FtsH12 knockdown miRNA",118,33216923,"MaxQuant score",98.3700000,,,,,3.9300001410614E-33,
NTSYHLPAWSVSILPDCK,ng,N,396,true,"Conserved N-glycosylation",74,22633491,"MaxQuant Score",120.5400000,1.0000000,,,,1.5050000091651E-14,-0.1640000
NTSYHLPAWSVSILPDCK,ng,N,396,true,"N-Glycopeptide Profiling in Arabidopsis Infloresce",132,27067053,"MOWSE score",36.1000000,,,,,2.8000000384054E-5,
NTSYHLPAWSVSILPDCK,ng,N,396,true,"N-linked Glycan Micro-heterogeneity Arabidopsis",134,29237727,,,,,,,,
NTSYHLPAWSVSILPDCK,ng,N,396,true,"UDP-GlcNAc transporter glycopeptide analysis",135,30224661,,,,,,,3.00215009814E-15,0.5000000
NELVDHINTTK,ng,N,469,true,"Conserved N-glycosylation",74,22633491,"MaxQuant Score",152.2700000,1.0000000,,,,9.9140002305688E-14,-0.4810000
NELVDHINTTK,ng,N,469,true,"N-glycan occupancy Arabidopsis glycoproteins",87,23994444,"Ladder score",69.8000000,,,,,,
NELVDHINTTK,ng,N,469,true,"N-Glycopeptide Profiling in Arabidopsis Infloresce",132,27067053,"MOWSE score",19.4000000,,,,,0.043999999761581,
NELVDHINTTK,ng,N,469,true,"N-linked Glycan Micro-heterogeneity Arabidopsis",134,29237727,,,,,,,,
NELVDHINTTK,ng,N,469,true,"UDP-GlcNAc transporter glycopeptide analysis",135,30224661,,,,,,,2.5821313403424E-12,0.5000000
EYLGTATGNGTHVPFKLK,ng,N,525,true,"N-Glycopeptide Profiling in Arabidopsis Infloresce",132,27067053,"MOWSE score",37.2000000,,,,,4.8999998398358E-5,
EYLGTATGNGTHVPFK,ng,N,525,true,"Conserved N-glycosylation",74,22633491,"MaxQuant Score",134.1300000,1.0000000,,,,4.1060001527491E-17,0.1060000
EYLGTATGNGTHVPFK,ng,N,525,true,"N-glycan occupancy Arabidopsis glycoproteins",87,23994444,"Ladder score",59.1000000,,,,,,
EYLGTATGNGTHVPFK,ng,N,525,true,"N-Glycopeptide Profiling in Arabidopsis Infloresce",132,27067053,"MOWSE score",41.8000000,,,,,3.9000001379463E-6,
EYLGTATGNGTHVPFK,ng,N,525,true,"N-linked Glycan Micro-heterogeneity Arabidopsis",134,29237727,,,,,,,,
EYLGTATGNGTHVPFK,ng,N,525,true,"UDP-GlcNAc transporter glycopeptide analysis",135,30224661,,,,,,,4.0626701161579E-17,1.1000000
GTLNLTNSK,ng,N,583,true,"Conserved N-glycosylation",74,22633491,"MaxQuant Score",131.0000000,1.0000000,,,,6.402999875102E-13,1.1810000
GTLNLTNSK,ng,N,583,true,"N-glycan occupancy Arabidopsis glycoproteins",87,23994444,"Ladder score",62.7000000,,,,,,
FMPDKCLTGCGEPSQR,acy,C,692,true,"Arabidopsis S-acylation atlas - Seedling",163d,35681017,,,,,,,,
FMPDKCLTGCGEPSQR,acy,C,696,true,"Arabidopsis S-acylation atlas - Seedling",163d,35681017,,,,,,,,
