Peptide,PTM,ModifiedAA,ModifiedPosition,PeptideUniqueToGene,ExperimentDesc,ExpID,PubmedID,ScoreType,IdentScore,LocProb,Log2FChange,PQ-val,QuantSig,PEP,MassErrorPPM
MDKYEVVKDLGAGNFGVAR,nta,M,1,true,"Arg/N-end rule pathway Roots",80,25728785,"MASCOT Score",24.0300000,,,,,0.011649999767542,
MDKYEVVKDLGAGNFGVAR,nta,M,1,true,"Arabidopsis translation initiation landscape - NTA",167a,35069635,,,,,,,,
ICDFGYSK,ox,C,142,false,"OxiTRAQ Arabidopsis - 5 mM H2O2 versus control",47,24376095,,,,0.1234167,0.3284713,NO,,
ICDFGYSK,sno,C,142,false,"hot5-4 / wildtype, FAT-switch S-nitrosoproteome",169,37277371,,,,0.6346391,0.0089187,YES,,
SSLLHSRPK,ph,S,154,false,"TOR Kinase and ABA Receptor",100,29290610,XCorr,2.2297068,1.0000000,,,,0.098810002207756,
SSLLHSRPK,ph,S,154,false,"Phospho cell culture sucrose/TOR",109,30833711,,,0.9999970,,,,,
PKSTVGTPAYIAPEVLSR,ub,K,157,false,"upl3 mutant / wildtype",168,35926874,"MaxQuant score",63.4880000,1.0000000,-0.2845459,,,0.00012892299855594,1.0305000
PKSTVGTPAYIAPEVLSR,ph,S,158,false,"atm and atr DNA damage response",88,25561503,"MASCOT Score",43.0000000,0.9460000,,,,,-1.4100000
PKSTVGTPAYIAPEVLSR,ph,S,158,false,"Tissue atlas Arabidopsis - ProteomicsDB",114,32188942,"MaxQuant score",215.0600000,0.9515950,,,,0,
STVGTPAYIAPEVLSR,ph,S,158,false,"srk2dei ABA signaling phopshoproteomics",83,23572148,"MASCOT Score",37.0000000,,,,,,0.0001000
STVGTPAYIAPEVLSR,ph,S,158,false,"LAXIC - mannitol vs control",84b,23660473,XCorr,3.6000000,0.9210000,,,,9.8899996373802E-5,
STVGTPAYIAPEVLSR,ph,S,158,false,"SnRK2 protein kinase substrates",85,23776212,XCorr,2.6406236,0.9260000,,,,1.6857300061054E-12,
STVGTPAYIAPEVLSR,ph,S,158,false,"atm and atr DNA damage response",88,25561503,"MASCOT Score",65.0000000,0.9290000,,,,,-0.5900000
STVGTPAYIAPEVLSR,ph,T,159,false,"srk2dei ABA signaling phopshoproteomics",83,23572148,"MASCOT Score",85.0000000,,,,,,-0.0004000
STVGTPAYIAPEVLSR,ph,T,159,false,"atm and atr DNA damage response",88,25561503,"MASCOT Score",40.0000000,0.9420000,,,,,0.0800000
STVGTPAYIAPEVLSR,ph,T,162,false,"srk2dei ABA signaling phopshoproteomics",83,23572148,"MASCOT Score",28.0000000,,,,,,0.0013000
STVGTPAYIAPEVLSR,ph,T,162,false,"Tissue atlas Arabidopsis - ProteomicsDB",114,32188942,"MaxQuant score",143.6700000,0.9972610,,,,2.3405200000326E-9,
IFVTNSAKR,ph,T,243,false,"SIRK1 exp - sirk1 mutant vs WT",86b,23820729,,,,-2.1701155,,NO,,
IFVTNSAKR,ph,T,243,false,"SIRK1 exp - 35S:SIRK1 vs WT",86c,23820729,,,,-1.6296033,,NO,,
IFVTNSAKR,ac,K,247,false,"Quantitative Acetylproteomics",101,29440448,,,,,,,,
