Peptide,PTM,ModifiedAA,ModifiedPosition,PeptideUniqueToGene,ExperimentDesc,ExpID,PubmedID,ScoreType,IdentScore,LocProb,Log2FChange,PQ-val,QuantSig,PEP,MassErrorPPM
AAELVSSATSEKLADVDWAKNIEICELAAR,nta,A,2,true,"Arg/N-end rule pathway Roots",80,25728785,"MASCOT Score",55.0400000,,,,,1.5230000371957E-6,
AAELVSSATSEK,nta,A,2,true,"Characterization plant N-terminal acetylation",6,22223895,"MASCOT Score",67.5700000,,,,,,
NIEICELAAR,ox,C,26,true,"SPEAR - 10 mM H2O2 / mock",138a,34619326,,,,2.7394001,0.0085656,YES,,
FTQRPNATPVVVTAQAVPR,ph,T,144,true,"Tissue atlas Arabidopsis - ProteomicsDB",114,32188942,"MaxQuant score",121.3500000,0.9994560,,,,1.3695099741751E-14,
FTQRPNATPVVVTAQAVPR,ph,T,149,true,"Tissue atlas Arabidopsis - ProteomicsDB",114,32188942,"MaxQuant score",79.4260000,0.9999950,,,,4.9521098844707E-5,
NEGPATTQQRESQSVSPSSILQK,ph,S,178,true,"Tissue atlas Arabidopsis - ProteomicsDB",114,32188942,"MaxQuant score",120.4000000,0.9540360,,,,3.5874099686311E-22,
ESQSVSPSSILQK,ph,S,180,true,"Tissue atlas Arabidopsis - ProteomicsDB",114,32188942,"MaxQuant score",135.8100000,0.9980060,,,,3.0373799745576E-5,
ESQSVSPSSILQK,ph,S,182,true,"Phosphoproteome ethylene-regulated time response",46,24043427,"MASCOT Score",35.3300000,,,,,,2.3795000
ESQSVSPSSILQK,ph,S,182,true,"Tyrosine phosphorylation in Arabidopsis",59,18463617,"MASCOT Score",46.0000000,,,,,,-0.9532371
ESQSVSPSSILQK,ph,S,182,true,"srk2dei ABA signaling phopshoproteomics",83,23572148,"MASCOT Score",41.0000000,,,,,,-0.0001000
ESQSVSPSSILQK,ph,S,182,true,"SnRK2 protein kinase substrates",85,23776212,XCorr,2.4735286,0.9210000,,,,3.3753600291675E-5,
ESQSVSPSSILQK,ph,S,182,true,"atm and atr DNA damage response",88,25561503,"MASCOT Score",38.0000000,1.0000000,,,,,-0.4300000
ESQSVSPSSILQK,ph,S,182,true,"TOR Kinase and ABA Receptor",100,29290610,XCorr,3.5228095,0.9891000,,,,0.0035149999894202,
ESQSVSPSSILQK,ph,S,182,true,"Lateral root-induction - NAA vs control",106,23328941,"MASCOT Score",43.0000000,,,,,,
ESQSVSPSSILQK,ph,S,182,true,"Phospho cell culture sucrose/TOR",109,30833711,,,0.9989460,,,,,
ESQSVSPSSILQK,ph,S,182,true,"Col-0 callus - FC Col-0 vs. Col-0 Xray",111a,31410901,,57.3800000,,0.4464349,0.0000000,NO,,0.4344551
ESQSVSPSSILQK,ph,S,182,true,"Col-0 X-ray callus - FC Col-0 vs. Col-0 Xray",111b,31410901,,57.3800000,,0.4464349,0.0000000,NO,,0.4344551
ESQSVSPSSILQK,ph,S,182,true,"atm callus - FC atm vs. atm Xray",111c,31410901,,57.3800000,,0.3666946,0.0000000,NO,,0.4344551
ESQSVSPSSILQK,ph,S,182,true,"atm-3 X-ray callus - FC atm vs. atm Xray",111d,31410901,,57.3800000,,0.3666946,0.0000000,NO,,0.4344551
ESQSVSPSSILQK,ph,S,182,true,"Tissue atlas Arabidopsis - ProteomicsDB",114,32188942,"MaxQuant score",267.4600000,0.9996390,,,,0,
ESQSVSPSSILQK,ph,S,182,true,"Touch-induced phosphorylation: 40s touch vs untouc",136,30291188,"MASCOT score",72.8800000,,-0.0437627,0.8464304,NO,,8.1338219
ESQSVSPSSILQK,ph,S,185,true,"Tyrosine phosphorylation in Arabidopsis",59,18463617,"MASCOT Score",27.0000000,,,,,,-0.4766184
ESQSVSPSSILQK,ph,S,185,true,"srk2dei ABA signaling phopshoproteomics",83,23572148,"MASCOT Score",35.0000000,,,,,,-0.0002000
STTSNGYHSNLEPVRPISNGDQKR,ph,S,292,true,"Tissue atlas Arabidopsis - ProteomicsDB",114,32188942,"MaxQuant score",56.3660000,0.8293750,,,,9.2609298008028E-5,
ASNANTESSSFISNR,ph,S,309,true,"Lateral root-induction - NAA vs control",106,23328941,"MASCOT Score",25.0000000,,,,,,
ASNANTESSSFISNR,ph,S,310,true,"Tissue atlas Arabidopsis - ProteomicsDB",114,32188942,"MaxQuant score",300.3000000,0.8709570,,,,0,
ASNANTESSSFISNR,ph,S,311,true,"Large-scale phosphorylation discovery",44,23111157,XCorr,4.7460000,,,,,,
ASNANTESSSFISNR,ph,S,311,true,"atm and atr DNA damage response",88,25561503,"MASCOT Score",78.0000000,0.9520000,,,,,0.0400000
ASNANTESSSFISNR,ph,S,311,true,"Phospho cell culture sucrose/TOR",109,30833711,,,0.9424960,,,,,
ASNANTESSSFISNR,ph,S,311,true,"Tissue atlas Arabidopsis - ProteomicsDB",114,32188942,"MaxQuant score",287.7800000,0.9407300,,,,0,
ASNANTESSSFISNR,ph,S,314,true,"Tissue atlas Arabidopsis - ProteomicsDB",114,32188942,"MaxQuant score",208.0700000,0.9980690,,,,2.8025969286496E-45,
ARPEDEEEPSPPQGLPGSAIHNER,ph,S,353,true,"Large-scale phosphorylation discovery",44,23111157,XCorr,3.9820000,,,,,,
ARPEDEEEPSPPQGLPGSAIHNER,ph,S,353,true,"atm and atr DNA damage response",88,25561503,"MASCOT Score",28.0000000,1.0000000,,,,,0.8000000
ARPEDEEEPSPPQGLPGSAIHNER,ph,S,353,true,"TOR Kinase and ABA Receptor",100,29290610,XCorr,3.4100282,1.0000000,,,,0.0011579999700189,
ARPEDEEEPSPPQGLPGSAIHNER,ph,S,353,true,"Tissue atlas Arabidopsis - ProteomicsDB",114,32188942,"MaxQuant score",125.9700000,1.0000000,,,,2.2007299103512E-27,
GGDSHSQSPPVVIPPPPAK,ph,S,387,true,"SnRK2 protein kinase substrates",85,23776212,XCorr,2.7083983,0.7730000,,,,0.085884898900986,
GGDSHSQSPPVVIPPPPAK,ph,S,387,true,"TOR Kinase and ABA Receptor",100,29290610,XCorr,4.2077889,0.9723000,,,,2.8609999844775E-6,
GGDSHSQSPPVVIPPPPAK,ph,S,387,true,"Tissue atlas Arabidopsis - ProteomicsDB",114,32188942,"MaxQuant score",79.2370000,1.0000000,,,,2.9324899514904E-5,
GGDSHSQSPPVVIPPPPAK,ph,S,389,true,"srk2dei ABA signaling phopshoproteomics",83,23572148,"MASCOT Score",22.0000000,,,,,,0.0005000
GGDSHSQSPPVVIPPPPAK,ph,S,389,true,"SnRK2 protein kinase substrates",85,23776212,XCorr,2.2336893,0.9950000,,,,0.012254299595952,
GGDSHSQSPPVVIPPPPAK,ph,S,389,true,"atm and atr DNA damage response",88,25561503,"MASCOT Score",32.0000000,0.9930000,,,,,1.3400000
GGDSHSQSPPVVIPPPPAK,ph,S,389,true,"Col-0 callus - FC Col-0 vs. Col-0 Xray",111a,31410901,,25.2100000,,0.8158528,0.0000000,NO,,0.4998008
GGDSHSQSPPVVIPPPPAK,ph,S,389,true,"Col-0 X-ray callus - FC Col-0 vs. Col-0 Xray",111b,31410901,,25.2100000,,0.8158528,0.0000000,NO,,0.4998008
GGDSHSQSPPVVIPPPPAK,ph,S,389,true,"atm callus - FC atm vs. atm Xray",111c,31410901,,25.2100000,,0.6853465,0.0000000,NO,,0.4998008
GGDSHSQSPPVVIPPPPAK,ph,S,389,true,"atm-3 X-ray callus - FC atm vs. atm Xray",111d,31410901,,25.2100000,,0.6853465,0.0000000,NO,,0.4998008
GGDSHSQSPPVVIPPPPAK,ph,S,389,true,"Tissue atlas Arabidopsis - ProteomicsDB",114,32188942,"MaxQuant score",181.2600000,1.0000000,,,,3.4733199859664E-36,
GGDSHSQSPPVVIPPPPAK,ph,S,391,true,"SnRK2 protein kinase substrates",85,23776212,XCorr,2.2336893,0.9990000,,,,0.012254299595952,
GGDSHSQSPPVVIPPPPAK,ph,S,391,true,"atm and atr DNA damage response",88,25561503,"MASCOT Score",32.0000000,1.0000000,,,,,1.3400000
GGDSHSQSPPVVIPPPPAK,ph,S,391,true,"TOR Kinase and ABA Receptor",100,29290610,XCorr,2.8793066,0.8991000,,,,0.0069320001639426,
GGDSHSQSPPVVIPPPPAK,ph,S,391,true,"Col-0 callus - FC Col-0 vs. Col-0 Xray",111a,31410901,,25.2100000,,0.8158528,0.0000000,NO,,0.4998008
GGDSHSQSPPVVIPPPPAK,ph,S,391,true,"Col-0 X-ray callus - FC Col-0 vs. Col-0 Xray",111b,31410901,,25.2100000,,0.8158528,0.0000000,NO,,0.4998008
GGDSHSQSPPVVIPPPPAK,ph,S,391,true,"atm callus - FC atm vs. atm Xray",111c,31410901,,25.2100000,,0.6853465,0.0000000,NO,,0.4998008
GGDSHSQSPPVVIPPPPAK,ph,S,391,true,"atm-3 X-ray callus - FC atm vs. atm Xray",111d,31410901,,25.2100000,,0.6853465,0.0000000,NO,,0.4998008
GGDSHSQSPPVVIPPPPAK,ph,S,391,true,"Tissue atlas Arabidopsis - ProteomicsDB",114,32188942,"MaxQuant score",198.7600000,1.0000000,,,,0,
GLSLHSR,ph,S,429,false,"srk2dei ABA signaling phopshoproteomics",83,23572148,"MASCOT Score",38.0000000,,,,,,0.0000000
GLSLHSR,ph,S,429,false,"Phospho cell culture sucrose/TOR",109,30833711,,,0.9999990,,,,,
GLSLHSR,ph,S,432,false,"Col-0 callus - FC Col-0 vs. Col-0 Xray",111a,31410901,,24.8700000,,-1.8112012,0.0000000,NO,,0.2998791
GLSLHSR,ph,S,432,false,"Col-0 X-ray callus - FC Col-0 vs. Col-0 Xray",111b,31410901,,24.8700000,,-1.8112012,0.0000000,NO,,0.2998791
GLSLHSR,ph,S,432,false,"atm callus - FC atm vs. atm Xray",111c,31410901,,24.8700000,,0.6915425,0.0000000,NO,,0.2998791
GLSLHSR,ph,S,432,false,"atm-3 X-ray callus - FC atm vs. atm Xray",111d,31410901,,24.8700000,,0.6915425,0.0000000,NO,,0.2998791
GLSLHSR,ph,S,432,false,"Tissue atlas Arabidopsis - ProteomicsDB",114,32188942,"MaxQuant score",143.0300000,1.0000000,,,,0.011321400292218,
SGSVDFSD,ph,S,442,true,"Tissue atlas Arabidopsis - ProteomicsDB",114,32188942,"MaxQuant score",156.5100000,0.9949270,,,,6.0807797686024E-10,
SGSVDFSD,ph,S,446,true,"atm and atr DNA damage response",88,25561503,"MASCOT Score",34.0000000,1.0000000,,,,,-0.5500000
SGSVDFSD,ph,S,446,true,"Tissue atlas Arabidopsis - ProteomicsDB",114,32188942,"MaxQuant score",161.7900000,1.0000000,,,,4.9796600176677E-10,
