Peptide,PTM,ModifiedAA,ModifiedPosition,PeptideUniqueToGene,ExperimentDesc,ExpID,PubmedID,ScoreType,IdentScore,LocProb,Log2FChange,PQ-val,QuantSig,PEP,MassErrorPPM
SVSVDEKKKSFSLQKSEEAFN,nt,S,38,true,"HUNTER N-terminome: legumain, GluC and trypsin",119,31951383,"MaxQuant score",79.5110000,,,,,,
SVSVDEKKKSF,nt,S,38,true,"Arabidopsis translation initiation landscape - NT",167b,35069635,,,,,,,,
SFSLQKSEEAFNAAK,ac,K,52,true,"Histone deacetylases substrates - hda14 vs WT",98e,29061669,"MaxQuant Score",90.7000000,1.0000000,0.4770000,0.1741807,NO,3.6000000758207E-9,
SFSLQKSEEAFNAAK,ac,K,52,true,"Quantitative Acetylproteomics",101,29440448,,,,,,,,
SEEAFNAAKNLMPGGVNSPVR,ac,K,61,false,"Quantitative Acetylproteomics",101,29440448,,,,,,,,
NLMPGGVNSPVRAFK,mox,M,64,false,"cat2 Methionine oxidation - 1h stress",62a,25693801,"MASCOT Score",62.0000000,,-0.0235272,,NO,,
NLMPGGVNSPVRAFK,mox,M,64,false,"cat2 Methionine oxidation - 3h stress",62b,25693801,"MASCOT Score",49.0000000,,-0.2139913,,NO,,
NLMPGGVNSPVR,ph,S,70,false,"Tissue atlas Arabidopsis - ProteomicsDB",114,32188942,"MaxQuant score",50.2920000,1.0000000,,,,0.0099133402109146,
AFKSVGGQPVLIDSVK,ac,K,76,true,"Quantitative Acetylproteomics",101,29440448,,,,,,,,
FVNSGTEACMGVLR,ox,C,168,false,"OxiTRAQ Arabidopsis - 5 mM H2O2 versus control",47,24376095,,,,0.3520666,0.0256215,NO,,
FVNSGTEACMGVLR,sno,C,168,false,"Site-specific nitrosomeproteomic id - gsnor1-3",90a,25699590,XCorr,3.6489739,,,,,0.00011059999815188,-5.3177955
FVNSGTEACMGVLR,sno,C,168,false,"Site-specific nitrosomeproteomic id - gsnor1-3",90b,25699590,XCorr,4.3700000,,,,,0.0042790002189577,-4.6900000
FVNSGTEACMGVLR,sno,C,168,false,"hot5-4 / wildtype, FAT-switch S-nitrosoproteome",169,37277371,,,,,,,,
FVNSGTEACMGVLR,so,C,168,false,"Arabidopsis S-sulfenylation chemoproteomics",108,31578252,"pFind PSM Score",0.1219460,,0.8333300,,,,-0.8674674
AFTNKEK,ac,K,181,true,"Quantitative Acetylproteomics",101,29440448,,,,,,,,
AGSGVATLGLPDSPGVPK,ph,S,204,false,"Tissue atlas Arabidopsis - ProteomicsDB",114,32188942,"MaxQuant score",147.7000000,0.9999140,,,,9.2605896276833E-24,
QAGTYEYLDKITK,ac,K,375,true,"Histone deacetylases - apicidin vs control",98a,29061669,"MaxQuant Score",81.0000000,1.0000000,0.6600000,0.1327394,NO,0.00022000000171829,
QAGTYEYLDKITK,ac,K,375,true,"Histone deacetylases substrates - hda14 vs WT",98e,29061669,"MaxQuant Score",52.5000000,1.0000000,0.0920000,0.9099133,NO,0.0020000000949949,
ELTNGILEAGKK,ac,K,389,false,"Quantitative Acetylproteomics",101,29440448,,,,,,,,
