Peptide,PTM,ModifiedAA,ModifiedPosition,PeptideUniqueToGene,ExperimentDesc,ExpID,PubmedID,ScoreType,IdentScore,LocProb,Log2FChange,PQ-val,QuantSig,PEP,MassErrorPPM
ATGGAAADLEDVQTVDLMSELLR,nt,A,2,true,"Stromal N-terminome",96,26371235,"MASCOT Score",47.8100000,,,,,,
ATGGAAADLE,nt,A,2,true,"N-term acetylation drought responses",5,26184543,,,,,,,,
ATGGAAADLE,nt,A,2,true,"Arg/N-end rule seed, prt6 vs. Wt",99,29168982,"MASCOT Score",35.4700000,,,,,0.014449999667704,0.0696266
ATGGAAADLEDVQTVDLMSELLRR,nta,A,2,true,"Mitochondrial intermediate peptidases - icp55 / WT",131a,25732537,,71.8600000,,,,,,
ATGGAAADLEDVQTVDLMSELLRR,nta,A,2,true,"Mitochondrial intermediate peptidases - oct1-1 / WT",131b,25732537,,68.5100000,,,,,,
ATGGAAADLEDVQTVDLMSELLRR,nta,A,2,true,"Mitochondrial intermediate peptidases - oct1-2 / WT",131c,25732537,,56.8700000,,,,,,
ATGGAAADLEDVQTVDLMSELLRR,nta,A,2,true,"Arabidopsis translation initiation landscape - NTA",167a,35069635,,,,,,,,
ATGGAAADLEDVQTVDLMSELLR,nta,A,2,true,"Characterization plant N-terminal acetylation",6,22223895,"MASCOT Score",87.9900000,,,,,,
ATGGAAADLEDVQTVDLMSELLR,nta,A,2,true,"Arg/N-end rule pathway Roots",80,25728785,"MASCOT Score",86.3900000,,,,,2.1900000035657E-8,
ATGGAAADLEDVQTVDLMSELLR,nta,A,2,true,"Stromal N-terminome",96,26371235,"MASCOT Score",47.8100000,,,,,,
ATGGAAADLEDVQTVDLMSELLR,nta,A,2,true,"FtsH12 N-terminome: WT / FtsH12 knockdown miRNA",118,33216923,"MaxQuant score",103.3900000,,-1.3022933,0.0805802,NO,3.0000000261765E-9,
ATGGAAADLE,nta,A,2,true,"N-term acetylation drought responses",5,26184543,,,,,,,,
ATGGAAADLE,nta,A,2,true,"Arg/N-end rule seed, prt6 vs. Wt",99,29168982,"MASCOT Score",35.4700000,,,,,0.014449999667704,0.0696266
ATGGAAADLEDVQTVDLMSELLR,ph,T,3,true,"SIRK1 phosphorylation",86a,23820729,"MaxQuant Score",123.3200000,1.0000000,,,,0.054000001400709,4.3360000
CSQKPDK,sno,C,28,true,"hot5-4 / wildtype, FAT-switch S-nitrosoproteome",169,37277371,,,,0.0899096,0.3735203,NO,,
LKCSQKPDKR,ub,K,31,true,"Arabidopsis ubiquitination COFRADIC",40,26744219,"MaxQuant Score",77.0620000,0.9950000,,,,0.0080000003799796,-0.1730000
DEYCLCHLSTGDMLR,sno,C,58,true,"hot5-4 / wildtype, FAT-switch S-nitrosoproteome",169,37277371,,,,,,,,
TPLGVKAK,ac,K,81,false,"Quantitative Acetylproteomics",101,29440448,,,,,,,,
TVTQAEKLDEMLKR,nt,T,122,true,"Arabidopsis translation initiation landscape - NT",167b,35069635,,,,,,,,
TVTQAEKLDEMLKR,ub,K,128,true,"Arabidopsis ubiquitination COFRADIC",40,26744219,"MaxQuant Score",200.5500000,1.0000000,,,,0,-0.1440000
TVTQAEKLDEMLKR,ac,K,134,true,"Quantitative Acetylproteomics",101,29440448,,,,,,,,
TVTQAEKLDEMLKR,ub,K,134,true,"Arabidopsis ubiquitination COFRADIC",40,26744219,"MaxQuant Score",200.5500000,1.0000000,,,,0,-0.1440000
GTEIDKVLNFAIDDAILEER,ub,K,142,true,"Arabidopsis ubiquitination COFRADIC",40,26744219,"MaxQuant Score",54.2250000,1.0000000,,,,1.2409999988901E-14,2.5930000
SYHTKFAPPKTPGVDDITGEPLIQR,nt,S,169,true,"Arabidopsis translation initiation landscape - NT",167b,35069635,,,,,,,,
SYHTKFAPPK,ac,K,173,false,"Quantitative Acetylproteomics",101,29440448,,,,,,,,
KDDNADVLKSR,ub,K,194,true,"Arabidopsis ubiquitination COFRADIC",40,26744219,"MaxQuant Score",208.8200000,1.0000000,,,,0,0.9150000
KDDNADVLKSR,ac,K,202,true,"Quantitative Acetylproteomics",101,29440448,,,,,,,,
DDNADVLKSR,ac,K,202,true,"Quantitative Acetylproteomics",101,29440448,,,,,,,,
KDDNADVLKSR,ub,K,202,true,"Arabidopsis ubiquitination COFRADIC",40,26744219,"MaxQuant Score",128.5400000,1.0000000,,,,3.7509998662699E-8,-0.0470000
APQEVTSEVK,ph,T,238,true,"SIRK1 phosphorylation",86a,23820729,"MaxQuant Score",50.0210000,0.9650000,,,,1.0650000572205,2.2570000
APQEVTSEVK,ph,S,239,true,"SIRK1 phosphorylation",86a,23820729,"MaxQuant Score",50.2910000,0.9860000,,,,1.0599999427795,9.0330000
APQEVTSEVK,ph,S,239,true,"SIRK1 exp - sirk1 mutant vs WT",86b,23820729,,,,0.3226624,,NO,,
APQEVTSEVK,ph,S,239,true,"SIRK1 exp - 35S:SIRK1 vs WT",86c,23820729,,,,-0.1692011,,NO,,
APQEVTSEVKK,ac,K,242,true,"Quantitative Acetylproteomics",101,29440448,,,,,,,,
