Peptide,PTM,ModifiedAA,ModifiedPosition,PeptideUniqueToGene,ExperimentDesc,ExpID,PubmedID,ScoreType,IdentScore,LocProb,Log2FChange,PQ-val,QuantSig,PEP,MassErrorPPM
ASGEGILTDGQWKKLEIATHN,nta,A,2,true,"HUNTER N-terminome: legumain, GluC and trypsin",119,31951383,"MaxQuant score",,,,,,,
ASGEGILTDGQWK,nta,A,2,true,"Characterization plant N-terminal acetylation",6,22223895,"MASCOT Score",59.3400000,,,,,,
KLEIATHNSGSLSSSPK,ph,S,25,true,"atm and atr DNA damage response",88,25561503,"MASCOT Score",23.0000000,0.9840000,,,,,1.3900000
KLEIATHNSGSLSSSPK,ph,S,25,true,"Tissue atlas Arabidopsis - ProteomicsDB",114,32188942,"MaxQuant score",202.7300000,0.9697310,,,,0,
KLEIATHNSGSLSSSPK,ph,S,28,true,"TOR Kinase and ABA Receptor",100,29290610,XCorr,3.4081199,0.8404000,,,,2.4119999579852E-5,
KLEIATHNSGSLSSSPK,ph,S,28,true,"Tissue atlas Arabidopsis - ProteomicsDB",114,32188942,"MaxQuant score",273.4100000,0.8991050,,,,0,
LEIATHNSGSLSSSPK,ph,S,28,true,"atm and atr DNA damage response",88,25561503,"MASCOT Score",32.0000000,0.9470000,,,,,-0.4200000
KLEIATHNSGSLSSSPK,ph,S,29,true,"PAMP-triggered phosphorylation",48,24601666,"MASCOT Score",24.3700000,,,,,,
KLEIATHNSGSLSSSPK,ph,S,29,true,"srk2dei ABA signaling phopshoproteomics",83,23572148,"MASCOT Score",44.0000000,,,,,,-0.0006000
KLEIATHNSGSLSSSPK,ph,S,29,true,"atm and atr DNA damage response",88,25561503,"MASCOT Score",23.0000000,0.9840000,,,,,1.3900000
KLEIATHNSGSLSSSPK,ph,S,29,true,"Col-0 callus - FC Col-0 vs. Col-0 Xray",111a,31410901,,69.0400000,,-1.2298074,0.0000000,NO,,1.3416534
KLEIATHNSGSLSSSPK,ph,S,29,true,"Col-0 X-ray callus - FC Col-0 vs. Col-0 Xray",111b,31410901,,69.0400000,,-1.2298074,0.0000000,NO,,1.3416534
KLEIATHNSGSLSSSPK,ph,S,29,true,"atm callus - FC atm vs. atm Xray",111c,31410901,,69.0400000,,0.8050333,0.0000000,NO,,1.3416534
KLEIATHNSGSLSSSPK,ph,S,29,true,"atm-3 X-ray callus - FC atm vs. atm Xray",111d,31410901,,69.0400000,,0.8050333,0.0000000,NO,,1.3416534
KLEIATHNSGSLSSSPK,ph,S,29,true,"Tissue atlas Arabidopsis - ProteomicsDB",114,32188942,"MaxQuant score",322.5400000,0.9226460,,,,0,
SHTLFADLNIKSPTGGK,ph,S,43,true,"Arabidopsis root NAA phosphoproteome",18a,27643528,"MaxQuant Score",54.8570000,0.9120000,,,,3.0710001738044E-5,-0.0060000
SHTLFADLNIKSPTGGK,ph,S,43,true,"Phosphoproteome ethylene-regulated time response",46,24043427,"MASCOT Score",68.4900000,,,,,,-0.4300000
SHTLFADLNIKSPTGGK,ph,S,43,true,"PAMP-triggered phosphorylation",48,24601666,"MASCOT Score",37.0000000,,,,,,
SHTLFADLNIKSPTGGK,ph,S,43,true,"srk2dei ABA signaling phopshoproteomics",83,23572148,"MASCOT Score",38.0000000,,,,,,0.0007000
SHTLFADLNIKSPTGGK,ph,S,43,true,"atm and atr DNA damage response",88,25561503,"MASCOT Score",33.0000000,0.9860000,,,,,0.0500000
SHTLFADLNIKSPTGGK,ph,S,43,true,"Phospho cell culture sucrose/TOR",109,30833711,,,0.9664940,,,,,
SHTLFADLNIKSPTGGK,ph,S,43,true,"Tissue atlas Arabidopsis - ProteomicsDB",114,32188942,"MaxQuant score",347.2900000,0.9998550,,,,0,
SPTGGKGPVAGIPNR,ph,T,45,true,"Tissue atlas Arabidopsis - ProteomicsDB",114,32188942,"MaxQuant score",90.6540000,0.8678080,,,,4.2889500036836E-5,
NDPNYDSGEDAYDGLVDSPVSDPLNDYKK,ph,S,103,true,"PAMP-triggered phosphorylation",48,24601666,"MASCOT Score",64.3700000,,,,,,
NDPNYDSGEDAYDGLVDSPVSDPLNDYKK,ph,S,103,true,"Conserved plant phosphoproteome - Arabidopsis",61a,20466843,"MASCOT Score",75.0000000,1.0000000,,,,,
NDPNYDSGEDAYDGLVDSPVSDPLNDYKK,ph,S,103,true,"srk2dei ABA signaling phopshoproteomics",83,23572148,"MASCOT Score",99.0000000,,,,,,-0.0007000
NDPNYDSGEDAYDGLVDSPVSDPLNDYKK,ph,S,103,true,"SnRK2 protein kinase substrates",85,23776212,XCorr,4.9200115,0.8220000,,,,6.8580601464419E-7,
NDPNYDSGEDAYDGLVDSPVSDPLNDYKK,ph,S,103,true,"TOR Kinase and ABA Receptor",100,29290610,XCorr,6.1656728,0.9706000,,,,1.7019999631884E-7,
NDPNYDSGEDAYDGLVDSPVSDPLNDYKK,ph,S,103,true,"Tissue atlas Arabidopsis - ProteomicsDB",114,32188942,"MaxQuant score",210.5800000,1.0000000,,,,0,
NDPNYDSGEDAYDGLVDSPVSDPLNDYK,ph,S,103,true,"srk2dei ABA signaling phopshoproteomics",83,23572148,"MASCOT Score",31.0000000,,,,,,-0.0014000
NDPNYDSGEDAYDGLVDSPVSDPLNDYK,ph,S,103,true,"TOR Kinase and ABA Receptor",100,29290610,XCorr,6.3992615,0.9240000,,,,2.5040000628529E-10,
NDPNYDSGEDAYDGLVDSPVSDPLNDYKK,ph,Y,108,true,"srk2dei ABA signaling phopshoproteomics",83,23572148,"MASCOT Score",68.0000000,,,,,,-0.0023000
NDPNYDSGEDAYDGLVDSPVSDPLNDYKK,ph,S,114,true,"srk2dei ABA signaling phopshoproteomics",83,23572148,"MASCOT Score",98.0000000,,,,,,-0.0014000
NDPNYDSGEDAYDGLVDSPVSDPLNDYKK,ph,S,114,true,"TOR Kinase and ABA Receptor",100,29290610,XCorr,6.1656728,0.8650000,,,,1.7019999631884E-7,
NDPNYDSGEDAYDGLVDSPVSDPLNDYK,ph,S,114,true,"srk2dei ABA signaling phopshoproteomics",83,23572148,"MASCOT Score",30.0000000,,,,,,-0.0014000
NDPNYDSGEDAYDGLVDSPVSDPLNDYKK,ph,Y,123,true,"srk2dei ABA signaling phopshoproteomics",83,23572148,"MASCOT Score",30.0000000,,,,,,-0.0054000
ILPESCK,sno,C,249,true,"hot5-4 / wildtype, FAT-switch S-nitrosoproteome",169,37277371,,,,-0.5187620,0.1282251,NO,,
ITSDQDGEKSSQDGK,ph,S,413,true,"atm and atr DNA damage response",88,25561503,"MASCOT Score",25.0000000,0.9920000,,,,,0.6900000
VNDSLDDLSLDIPNAK,ph,S,664,true,"Tissue atlas Arabidopsis - ProteomicsDB",114,32188942,"MaxQuant score",128.3900000,0.9999990,,,,9.7125997911007E-8,
