Peptide,PTM,ModifiedAA,ModifiedPosition,PeptideUniqueToGene,ExperimentDesc,ExpID,PubmedID,ScoreType,IdentScore,LocProb,Log2FChange,PQ-val,QuantSig,PEP,MassErrorPPM
SVKVQQQQQPPPAWPGRAVPEAPRQSWD,nt,S,51,true,"HUNTER N-terminome: legumain, GluC and trypsin",119,31951383,"MaxQuant score",76.2370000,,,,,,
SVKVQQQQQPPPAWPGRAVPE,nt,S,51,true,"N-terminal ChaFRADIC",92,26010716,"MASCOT Score",34.1500000,,,,,6.2499999842203E-8,
SVKVQQQQQPPPAWPGRAVPE,nt,S,51,true,"Arg/N-end rule seed, prt6 vs. Wt",99,29168982,"MASCOT Score",30.6100000,,-0.2985154,0.4321872,NO,6.5629999213002E-9,-2.9065018
SVKVQQQQQPPPAWPGRAVPE,nt,S,51,true,"HUNTER N-terminome: legumain, GluC and trypsin",119,31951383,"MaxQuant score",123.9900000,,,,,,
SVKVQQQQQPPPAWPGR,nt,S,51,true,"N-terminal ChaFRADIC",92,26010716,"MASCOT Score",41.7400000,,,,,4.999999980021E-12,
SVKVQQQQQPPPAWPGR,nt,S,51,true,"Stromal N-terminome",96,26371235,"MASCOT Score",68.5700000,,,,,,
SVKVQQQQQPPPAWPGR,nt,S,51,true,"Arg/N-end rule seed, prt6 vs. Wt",99,29168982,"MASCOT Score",34.9200000,,0.0228606,0.9322637,NO,0.00011749999976018,-1.7610135
SVKVQQQQQPPPAWPGR,nt,S,51,true,"FtsH12 N-terminome: WT / FtsH12 knockdown miRNA",118,33216923,"MaxQuant score",53.5280000,,,,,0.0049545001238585,
SVKVQQQQQPPPAWPGR,nt,S,51,true,"HUNTER N-terminome: legumain, GluC and trypsin",119,31951383,"MaxQuant score",104.8800000,,,,,,
NESLINELK,ph,S,139,true,"Tissue atlas Arabidopsis - ProteomicsDB",114,32188942,"MaxQuant score",160.6700000,1.0000000,,,,0.00015373299538624,
DWPVEKLK,ac,K,266,true,"Quantitative Acetylproteomics",101,29440448,,,,,,,,
VPCSEVTWPR,sno,C,361,true,"hot5-4 / wildtype, FAT-switch S-nitrosoproteome",169,37277371,,,,0.1352962,0.2829783,NO,,
