Peptide,PTM,ModifiedAA,ModifiedPosition,PeptideUniqueToGene,ExperimentDesc,ExpID,PubmedID,ScoreType,IdentScore,LocProb,Log2FChange,PQ-val,QuantSig,PEP,MassErrorPPM
MREILHIQGGQCGNQIGAK,acy,C,12,false,"Arabidopsis S-acylation atlas - Stem",163f,35681017,,,,,,,,
EILHIQGGQCGNQIGAK,acy,C,12,false,"Arabidopsis S-acylation atlas - Silique",163e,35681017,,,,,,,,
EILHIQGGQCGNQIGAK,sno,C,12,false,"Site-specific nitrosomeproteomic id - gsnor1-3",90a,25699590,XCorr,3.1991031,,,,,0.0024540000595152,-2.4165898
EILHIQGGQCGNQIGAK,sno,C,12,false,"Site-specific nitrosomeproteomic id - gsnor1-3",90b,25699590,XCorr,2.2300000,,,,,0.00096530001610518,-6.6300000
EILHIQGGQCGNQIGAK,sno,C,12,false,"hot5-4 / wildtype, FAT-switch S-nitrosoproteome",169,37277371,,,,,,,,
MREILHIQGGQCGNQIGAK,so,C,12,false,"S-sulfenylation site detection using YAP1C",110,32714340,,,,,,,,
EILHIQGGQCGNQIGAK,so,C,12,false,"Arabidopsis S-sulfenylation chemoproteomics",108,31578252,"pFind PSM Score",0.0005772,,1.2642900,,,,-1.0109750
FWEVVCAEHGIDPTGR,sno,C,25,false,"Site-specific nitrosomeproteomic id - gsnor1-3",90a,25699590,XCorr,2.8700000,,,,,0.059889998286963,-6.8600000
FWEVVCAEHGIDPTGR,sno,C,25,false,"Site-specific nitrosomeproteomic id - gsnor1-3",90b,25699590,XCorr,4.3000000,,,,,0.0033489998895675,-7.8500000
FWEVVCAEHGIDPTGR,sno,C,25,false,"hot5-4 / wildtype, FAT-switch S-nitrosoproteome",169,37277371,,,,,,,,
FWEVVCAEHGIDPTGR,so,C,25,false,"Arabidopsis S-sulfenylation chemoproteomics",108,31578252,"pFind PSM Score",0.0116973,,2.1164000,,,,-0.9722571
FWEVVCAEHGIDPTGR,so,C,25,false,"S-sulfenylation site detection using YAP1C",110,32714340,,,,,,,,
AEHGIDPTGR,nt,A,26,false,"Arg/N-end rule seed, prt6 vs. Wt",99,29168982,"MASCOT Score",40.9700000,,-0.4116877,0.0316490,NO,0.010649999603629,-0.3118077
YTGDSDLQLER,ph,S,40,false,"Tissue atlas Arabidopsis - ProteomicsDB",114,32188942,"MaxQuant score",96.8660000,0.9999940,,,,0.00010685499728424,
INVYYNEASCGR,ph,S,55,false,"Tissue atlas Arabidopsis - ProteomicsDB",114,32188942,"MaxQuant score",199.4100000,1.0000000,,,,5.6354398828146E-25,
INVYYNEASCGR,ox,C,56,false,"OxiTRAQ Arabidopsis - 5 mM H2O2 versus control",47,24376095,,,,0.2464302,0.0584840,NO,,
INVYYNEASCGR,ox,C,56,false,"SPEAR - 50 mM H2O2 / mock",138b,34619326,,,,1.0968456,0.0201983,YES,,
INVYYNEASCGR,sno,C,56,false,"Endogenous S-nitrosylation in Arabidopsis",64,22115780,"MASCOT Score",41.0000000,,,,,,
INVYYNEASCGR,sno,C,56,false,"Site-specific nitrosomeproteomic id - gsnor1-3",90a,25699590,XCorr,2.4015646,,,,,7.3379997047596E-5,-5.9821677
INVYYNEASCGR,sno,C,56,false,"Site-specific nitrosomeproteomic id - gsnor1-3",90b,25699590,XCorr,2.4100000,,,,,0.0013050000416115,-5.5200000
INVYYNEASCGR,sno,C,56,false,"hot5-4 / wildtype, FAT-switch S-nitrosoproteome",169,37277371,,,,-0.0751563,0.5252911,NO,,
INVYYNEASCGRFVPR,so,C,56,false,"S-sulfenylation site detection using YAP1C",110,32714340,,,,,,,,
INVYYNEASCGR,so,C,56,false,"Arabidopsis S-sulfenylation chemoproteomics",108,31578252,"pFind PSM Score",0.0036730,,2.5000000,,,,-1.0693202
QSGAGNNWAKGHYTE,nt,Q,94,false,"HUNTER N-terminome: legumain, GluC and trypsin",119,31951383,"MaxQuant score",63.4730000,,,,,,
EAENCDCLQGFQVCHSLGGGTGSGMGTLLISK,so,C,136,false,"S-sulfenylation site detection using YAP1C",110,32714340,,,,,,,,
SLGGGTGSGMGTLLISKIREEYPDR,nt,S,138,false,"Arabidopsis translation initiation landscape - NT",167b,35069635,,,,,,,,
PYNATLSVHQLVE,nt,P,182,false,"Arg/N-end rule seed, prt6 vs. Wt",99,29168982,"MASCOT Score",32.9900000,,,,,0.00049619999481365,0.7317970
PYNATLSVHQLVE,nta,P,182,false,"Arg/N-end rule seed, prt6 vs. Wt",99,29168982,"MASCOT Score",32.9900000,,,,,0.00049619999481365,0.7317970
SVHQLVENADECMVLDNEALY,nt,S,188,false,"Arabidopsis translation initiation landscape - NT",167b,35069635,,,,,,,,
KLAVNLIPFPR,cr,K,252,false,"Open search Plant PTM Viewer 2.0 - Crotonylation",164c,TBA,,,,,,,,
KLAVNLIPFPR,hib,K,252,false,"Open search Plant PTM Viewer 2.0 - hib",164e,TBA,,,,,,,,
NMMCAADPR,nt,N,298,false,"Metacaspase9 substrates - in vitro rMC9",51c,23964026,"MASCOT Score",41.0000000,,,,,,-0.3429202
NMMCAADPR,acy,C,301,false,"Arabidopsis S-acylation atlas - Meristem",163a,35681017,,,,,,,,
NMMCAADPR,acy,C,301,false,"Arabidopsis S-acylation atlas - Silique",163e,35681017,,,,,,,,
NMMCAADPR,ox,C,301,false,"OxiTRAQ Arabidopsis - 5 mM H2O2 versus control",47,24376095,,,,0.0163092,0.7707895,NO,,
NMMCAADPR,sno,C,301,false,"Endogenous S-nitrosylation in Arabidopsis",64,22115780,"MASCOT Score",33.0000000,,,,,,
NMMCAADPR,sno,C,301,false,"hot5-4 / wildtype, FAT-switch S-nitrosoproteome",169,37277371,,,,,,,,
NMMCAADPR,so,C,301,false,"S-sulfenylation site detection using YAP1C",110,32714340,,,,,,,,
SAMFRGKMSTKEV,nt,S,314,false,"Arabidopsis translation initiation landscape - NT",167b,35069635,,,,,,,,
NKNSSYFVE,nt,N,335,false,"Arg/N-end rule seed, prt6 vs. Wt",99,29168982,"MASCOT Score",24.2400000,,,,,0.0081970002502203,0.4198821
STVCDIPPTGLK,sno,C,354,false,"Site-specific nitrosomeproteomic id - gsnor1-3",90a,25699590,XCorr,2.8798952,,,,,0.013109999708831,-6.6168149
STVCDIPPTGLK,sno,C,354,false,"Site-specific nitrosomeproteomic id - gsnor1-3",90b,25699590,XCorr,2.3300000,,,,,0.103900000453,-6.3300000
STVCDIPPTGLK,sno,C,354,false,"hot5-4 / wildtype, FAT-switch S-nitrosoproteome",169,37277371,,,,,,,,
STVCDIPPTGLK,so,C,354,false,"S-sulfenylation site detection using YAP1C",110,32714340,,,,,,,,
MASTFIGNSTSIQE,nt,M,363,false,"Arg/N-end rule seed, prt6 vs. Wt",99,29168982,"MASCOT Score",61.5400000,,-0.2838486,0.2287198,NO,5.9729998611147E-5,-0.3678385
STFIGNSTSIQE,nt,S,365,false,"Arg/N-end rule seed, prt6 vs. Wt",99,29168982,"MASCOT Score",66.5600000,,-0.5304482,0.0144428,NO,3.6120000004303E-5,-1.4681489
TFIGNSTSIQE,nt,T,366,false,"Arg/N-end rule seed, prt6 vs. Wt",99,29168982,"MASCOT Score",49.3200000,,0.2594126,0.2698354,NO,0.00082229997497052,-1.2675417
FIGNSTSIQE,nt,F,367,false,"Arg/N-end rule seed, prt6 vs. Wt",99,29168982,"MASCOT Score",50.0500000,,-0.6841743,0.4216838,NO,0.00033099998836406,-1.2172912
IGNSTSIQE,nt,I,368,false,"Arg/N-end rule seed, prt6 vs. Wt",99,29168982,"MASCOT Score",28.5900000,,0.1803285,0.6376613,NO,0.060809999704361,-0.6958837
