Peptide,PTM,ModifiedAA,ModifiedPosition,PeptideUniqueToGene,ExperimentDesc,ExpID,PubmedID,ScoreType,IdentScore,LocProb,Log2FChange,PQ-val,QuantSig,PEP,MassErrorPPM
WFSFHQR,ph,S,10,true,"MAPK Arabidopsis substrates",45,23172892,"MaxQuant Score",85.0640000,,,,,,
WFSFHQR,ph,S,10,true,"TOR Kinase and ABA Receptor",100,29290610,XCorr,2.1833584,1.0000000,,,,0.0065029999241233,
WFSFHQR,ph,S,10,true,"Phospho cell culture sucrose/TOR",109,30833711,,,1.0000000,,,,,
SSSATTTTLPQHK,ph,S,17,true,"TOR Kinase and ABA Receptor",100,29290610,XCorr,2.9993527,0.9159000,,,,0.00028159999055788,
SSSATTTTLPQHK,ph,S,17,true,"Phospho cell culture sucrose/TOR",109,30833711,,,0.9929540,,,,,
SSSATTTTLPQHK,ph,S,17,true,"Col-0 callus - FC Col-0 vs. Col-0 Xray",111a,31410901,,34.3300000,,-1.8677030,0.0000000,NO,,0.4380262
SSSATTTTLPQHK,ph,S,17,true,"Col-0 X-ray callus - FC Col-0 vs. Col-0 Xray",111b,31410901,,34.3300000,,-1.8677030,0.0000000,NO,,0.4380262
SSSATTTTLPQHK,ph,S,17,true,"atm callus - FC atm vs. atm Xray",111c,31410901,,34.3300000,,-0.5154959,0.0000000,NO,,0.4380262
SSSATTTTLPQHK,ph,S,17,true,"atm-3 X-ray callus - FC atm vs. atm Xray",111d,31410901,,34.3300000,,-0.5154959,0.0000000,NO,,0.4380262
SSSATTTTLPQHK,ph,S,17,true,"Tissue atlas Arabidopsis - ProteomicsDB",114,32188942,"MaxQuant score",190.7800000,0.9999680,,,,3.1209399464614E-30,
DPNPSPGQSPGPGDK,ph,S,129,true,"TOR Kinase and ABA Receptor",100,29290610,XCorr,4.3621287,1.0000000,,,,2.4340000891243E-5,
DPNPSPGQSPGPGDK,ph,S,129,true,"Lateral root-induction - NAA vs control",106,23328941,"MASCOT Score",35.0000000,,,,,,
DPNPSPGQSPGPGDK,ph,S,133,true,"TOR Kinase and ABA Receptor",100,29290610,XCorr,4.3621287,1.0000000,,,,2.4340000891243E-5,
NSMSPTTSLESVTIGQSSYHPVR,ph,S,173,true,"Tissue atlas Arabidopsis - ProteomicsDB",114,32188942,"MaxQuant score",233.1900000,0.9999970,,,,0,
AVSMFSSSTTSSSSGVFAGADSPFR,ph,S,195,true,"TOR Kinase and ABA Receptor",100,29290610,XCorr,3.3575287,0.9671000,,,,0.00028330000350252,
AVSMFSSSTTSSSSGVFAGADSPFR,ph,S,195,true,"Tissue atlas Arabidopsis - ProteomicsDB",114,32188942,"MaxQuant score",256.3300000,0.9999880,,,,0,
NAMSFSSTDHSSSPMSPEEEEIFNK,ph,S,221,true,"TOR Kinase and ABA Receptor",100,29290610,XCorr,4.4916267,0.8246000,,,,1.2679999599641E-5,
NAMSFSSTDHSSSPMSPEEEEIFNK,ph,S,221,true,"Tissue atlas Arabidopsis - ProteomicsDB",114,32188942,"MaxQuant score",224.0600000,0.9998570,,,,0,
NAMSFSSTDHSSSPMSPEEEEIFNK,ph,T,225,true,"Large-scale phosphorylation discovery",44,23111157,XCorr,5.3350000,,,,,,
NAMSFSSTDHSSSPMSPEEEEIFNK,ph,T,225,true,"Lateral root-induction - NAA vs control",106,23328941,"MASCOT Score",35.0000000,,,,,,
VSLCTDR,sno,C,273,true,"hot5-4 / wildtype, FAT-switch S-nitrosoproteome",169,37277371,,,,,,,,
GGGGGESEFGENAEAR,ph,S,520,true,"Tissue atlas Arabidopsis - ProteomicsDB",114,32188942,"MaxQuant score",78.9320000,1.0000000,,,,0.00034141400828958,
GGFAYSSQF,ph,S,556,false,"atm and atr DNA damage response",88,25561503,"MASCOT Score",29.0000000,0.9890000,,,,,0.6900000
GGFAYSSQF,ph,S,556,false,"TOR Kinase and ABA Receptor",100,29290610,XCorr,3.4832480,0.9898000,,,,0.00022400000307243,
