Peptide,PTM,ModifiedAA,ModifiedPosition,PeptideUniqueToGene,ExperimentDesc,ExpID,PubmedID,ScoreType,IdentScore,LocProb,Log2FChange,PQ-val,QuantSig,PEP,MassErrorPPM
SVSSAASGNSINSK,ph,S,14,true,"Tissue atlas Arabidopsis - ProteomicsDB",114,32188942,"MaxQuant score",69.3790000,0.8501060,,,,0.0013544399989769,
SVSSAASGNSINSK,ph,S,17,true,"Tissue atlas Arabidopsis - ProteomicsDB",114,32188942,"MaxQuant score",163.9000000,0.9889490,,,,4.8275199809877E-11,
SKEGKPPVPDFSASSMPR,ph,S,46,true,"Tissue atlas Arabidopsis - ProteomicsDB",114,32188942,"MaxQuant score",181.3500000,0.7799260,,,,6.2617602576438E-36,
VVSAVSQSTTVLDLSGKK,ph,S,60,true,"Tissue atlas Arabidopsis - ProteomicsDB",114,32188942,"MaxQuant score",137.7200000,0.8161420,,,,1.678940003653E-15,
RLSIPNKPTSNSSVK,ph,S,83,true,"atm and atr DNA damage response",88,25561503,"MASCOT Score",22.0000000,1.0000000,,,,,-1.5200000
RLSIPNKPTSNSSVK,ph,S,83,true,"TOR Kinase and ABA Receptor",100,29290610,XCorr,2.5544474,1.0000000,,,,0.012520000338554,
SVSSSVTSLSEVKPK,ph,S,96,true,"atm and atr DNA damage response",88,25561503,"MASCOT Score",26.0000000,1.0000000,,,,,0.0200000
SVSSSVTSLSEVKPK,ph,S,98,true,"atm and atr DNA damage response",88,25561503,"MASCOT Score",26.0000000,0.9680000,,,,,0.0200000
SVSSSVTSLSEVKPK,ph,S,99,true,"Tissue atlas Arabidopsis - ProteomicsDB",114,32188942,"MaxQuant score",162.3700000,0.7751300,,,,2.3890099967727E-12,
SVSSSVTSLSEVKPK,ph,S,100,true,"Tissue atlas Arabidopsis - ProteomicsDB",114,32188942,"MaxQuant score",164.6500000,0.9815050,,,,8.6970399415173E-13,
SVSSSVTSLSEVKPK,ph,S,103,true,"Large-scale phosphorylation discovery",44,23111157,XCorr,3.9630000,,,,,,
SVSSSVTSLSEVKPK,ph,S,103,true,"atm and atr DNA damage response",88,25561503,"MASCOT Score",26.0000000,1.0000000,,,,,0.0200000
SVSSSVTSLSEVKPK,ph,S,103,true,"Tissue atlas Arabidopsis - ProteomicsDB",114,32188942,"MaxQuant score",237.0500000,0.8906060,,,,0,
SVSSSVTSLSEVKPK,ph,S,105,true,"Tissue atlas Arabidopsis - ProteomicsDB",114,32188942,"MaxQuant score",193.3000000,0.9993490,,,,6.5305699869436E-34,
SFNETTTPVSSNLR,ph,T,124,true,"Large-scale phosphorylation discovery",44,23111157,XCorr,3.1690000,,,,,,
SFNETTTPVSSNLR,ph,T,124,true,"Tissue atlas Arabidopsis - ProteomicsDB",114,32188942,"MaxQuant score",159.2200000,0.8630410,,,,4.3503001201373E-10,
DDALQDSTVTK,ph,S,266,true,"Tissue atlas Arabidopsis - ProteomicsDB",114,32188942,"MaxQuant score",117.0300000,0.8023540,,,,2.7909800337511E-5,
SLEVINVNQENDSEVVQESEEGLRPSADGVQIVTVVKPSDK,ph,S,349,true,"Tissue atlas Arabidopsis - ProteomicsDB",114,32188942,"MaxQuant score",279.8400000,1.0000000,,,,0,
KETVPKNNLPVR,ub,K,399,true,"Arabidopsis ubiquitination COFRADIC",40,26744219,"MaxQuant Score",84.4790000,1.0000000,,,,0.00021309999283403,-1.7020000
