Peptide,PTM,ModifiedAA,ModifiedPosition,PeptideUniqueToGene,ExperimentDesc,ExpID,PubmedID,ScoreType,IdentScore,LocProb,Log2FChange,PQ-val,QuantSig,PEP,MassErrorPPM
TKSSPAPSPLR,ph,S,87,true,"Tissue atlas Arabidopsis - ProteomicsDB",114,32188942,"MaxQuant score",119.7700000,0.9953210,,,,2.4570299501647E-5,
TKSSPAPSPLR,ph,S,88,true,"Tissue atlas Arabidopsis - ProteomicsDB",114,32188942,"MaxQuant score",89.6420000,0.9853830,,,,0.00034239300293848,
SSPAPSPLR,ph,S,92,true,"Tissue atlas Arabidopsis - ProteomicsDB",114,32188942,"MaxQuant score",112.6700000,1.0000000,,,,2.4570299501647E-5,
FSSATPLISPGQDDKDVAK,ph,S,98,true,"Tissue atlas Arabidopsis - ProteomicsDB",114,32188942,"MaxQuant score",163.1500000,0.7532370,,,,1.1973099840971E-22,
FSSATPLISPGQDDK,ph,T,100,true,"Tissue atlas Arabidopsis - ProteomicsDB",114,32188942,"MaxQuant score",229.9600000,0.9982370,,,,0,
FSSATPLISPGQDDKDVAK,ph,S,104,true,"Tissue atlas Arabidopsis - ProteomicsDB",114,32188942,"MaxQuant score",229.9600000,1.0000000,,,,0,
SQRVPANSNPGVESTHVGLAK,ph,S,152,true,"Tissue atlas Arabidopsis - ProteomicsDB",114,32188942,"MaxQuant score",145.6000000,0.9999960,,,,1.6684099996633E-25,
VPANSNPGVESTHVGLAK,ph,S,159,true,"Tissue atlas Arabidopsis - ProteomicsDB",114,32188942,"MaxQuant score",164.1300000,0.9999950,,,,4.429049833597E-22,
VPANSNPGVESTHVGLAK,ph,S,165,true,"Tissue atlas Arabidopsis - ProteomicsDB",114,32188942,"MaxQuant score",232.1500000,0.9002690,,,,0,
SFSHELNSK,ph,S,198,false,"Tissue atlas Arabidopsis - ProteomicsDB",114,32188942,"MaxQuant score",115.2900000,0.9985460,,,,0.00039631899562664,
SFSHELNSK,ph,S,200,false,"srk2dei ABA signaling phopshoproteomics",83,23572148,"MASCOT Score",29.0000000,,,,,,-0.0005000
SFSHELNSK,ph,S,200,false,"LAXIC - mannitol vs control",84b,23660473,XCorr,2.5300000,0.9900000,,,,0.071158200502396,
SFSHELNSK,ph,S,200,false,"atm and atr DNA damage response",88,25561503,"MASCOT Score",47.0000000,1.0000000,,,,,-0.2400000
SFSHELNSK,ph,S,200,false,"TOR Kinase and ABA Receptor",100,29290610,XCorr,2.8574071,0.9923000,,,,0.012900000438094,
SFSHELNSK,ph,S,200,false,"Lateral root-induction - NAA vs control",106,23328941,"MASCOT Score",27.0000000,,,,,,
SFSHELNSK,ph,S,200,false,"Phospho cell culture sucrose/TOR",109,30833711,,,0.9999960,,,,,
SFSHELNSK,ph,S,200,false,"Tissue atlas Arabidopsis - ProteomicsDB",114,32188942,"MaxQuant score",196.4400000,0.9999990,,,,1.2788700654021E-10,
SFSHELNSK,ph,S,205,false,"Tissue atlas Arabidopsis - ProteomicsDB",114,32188942,"MaxQuant score",106.2900000,1.0000000,,,,0.0006561009795405,
QDDQNSNSGADGVEVNTAR,ph,S,390,true,"Tissue atlas Arabidopsis - ProteomicsDB",114,32188942,"MaxQuant score",280.4000000,1.0000000,,,,0,
QDDQNSNSGADGVEVNTAR,ph,T,401,true,"Tissue atlas Arabidopsis - ProteomicsDB",114,32188942,"MaxQuant score",179.6300000,1.0000000,,,,1.408100030759E-35,
STDSTSSNFR,ph,S,410,true,"Tissue atlas Arabidopsis - ProteomicsDB",114,32188942,"MaxQuant score",114.7100000,0.8863760,,,,0.00018921299488284,
KLPSAAEK,ph,S,422,true,"Tissue atlas Arabidopsis - ProteomicsDB",114,32188942,"MaxQuant score",81.7990000,1.0000000,,,,0.0065637500956655,
VYGDENAENLHSPSGQPASADR,ph,S,457,true,"Tissue atlas Arabidopsis - ProteomicsDB",114,32188942,"MaxQuant score",259.7000000,0.9990670,,,,0,
VYGDENAENLHSPSGQPASADR,ph,S,464,true,"Tissue atlas Arabidopsis - ProteomicsDB",114,32188942,"MaxQuant score",140.2100000,0.9877050,,,,7.558280168533E-29,
ILESWTPK,ph,T,539,true,"Tissue atlas Arabidopsis - ProteomicsDB",114,32188942,"MaxQuant score",118.4000000,0.9988480,,,,0.0082528796046972,
AVADSARLSNSSR,ph,S,552,true,"Tissue atlas Arabidopsis - ProteomicsDB",114,32188942,"MaxQuant score",82.7090000,0.9999970,,,,0.00051756197353825,
AVADSARLSNSSR,ph,S,556,true,"Tissue atlas Arabidopsis - ProteomicsDB",114,32188942,"MaxQuant score",82.7090000,0.9983060,,,,0.00051756197353825,
QEDLDEISQR,ph,S,568,true,"Tissue atlas Arabidopsis - ProteomicsDB",114,32188942,"MaxQuant score",146.3600000,1.0000000,,,,7.1549601443621E-7,
CSDDMLDCVPR,ph,S,572,true,"Tissue atlas Arabidopsis - ProteomicsDB",114,32188942,"MaxQuant score",87.8310000,1.0000000,,,,0.00054928101599216,
DSSAGSLTPPSPATPR,ph,T,612,true,"Tissue atlas Arabidopsis - ProteomicsDB",114,32188942,"MaxQuant score",125.4500000,0.9989270,,,,1.8595399525756E-11,
DSSAGSLTPPSPATPR,ph,S,615,true,"Tissue atlas Arabidopsis - ProteomicsDB",114,32188942,"MaxQuant score",125.4500000,0.9824100,,,,6.6775299956134E-7,
NSQVDLLLSGR,ph,S,622,true,"Tissue atlas Arabidopsis - ProteomicsDB",114,32188942,"MaxQuant score",141.4600000,1.0000000,,,,3.3423700074309E-7,
NSQVDLLLSGRK,ph,S,629,true,"Tissue atlas Arabidopsis - ProteomicsDB",114,32188942,"MaxQuant score",63.9180000,0.9999990,,,,0.0017322700005025,
KTISELENYQQINK,ph,T,633,true,"Tissue atlas Arabidopsis - ProteomicsDB",114,32188942,"MaxQuant score",195.4500000,0.9999890,,,,2.8925100319074E-31,
VDSSNAMPDEESSADEDTVR,ph,S,727,true,"Tissue atlas Arabidopsis - ProteomicsDB",114,32188942,"MaxQuant score",110.6100000,0.9976530,,,,3.4423800615579E-12,
SLRASPLNPR,ph,S,735,true,"Tissue atlas Arabidopsis - ProteomicsDB",114,32188942,"MaxQuant score",91.8120000,1.0000000,,,,0.0008033060003072,
SLRASPLNPR,ph,S,739,true,"Tissue atlas Arabidopsis - ProteomicsDB",114,32188942,"MaxQuant score",130.4400000,1.0000000,,,,5.3448799008038E-5,
YSFSNFSFK,ph,S,1128,false,"Tissue atlas Arabidopsis - ProteomicsDB",114,32188942,"MaxQuant score",120.5400000,0.9994730,,,,0.00028170499717817,
YSFSNFSFK,ph,S,1130,false,"Tissue atlas Arabidopsis - ProteomicsDB",114,32188942,"MaxQuant score",98.7540000,0.9918160,,,,0.001287049963139,
YSFSNFSFK,ph,S,1133,false,"Tissue atlas Arabidopsis - ProteomicsDB",114,32188942,"MaxQuant score",207.6700000,1.0000000,,,,5.0743901573345E-16,
ESVEASNQSAPRPET,ph,S,1162,true,"Tissue atlas Arabidopsis - ProteomicsDB",114,32188942,"MaxQuant score",138.0500000,0.9979820,,,,1.4486799955193E-6,
ESVEASNQSAPRPET,ph,T,1168,true,"Pollen phosphoproteome Arabidopsis",43,22631563,"MASCOT Score",52.7700000,,,,,,-1.4520500
ESVEASNQSAPRPET,ph,T,1168,true,"Tissue atlas Arabidopsis - ProteomicsDB",114,32188942,"MaxQuant score",291.0200000,1.0000000,,,,0,
