Peptide,PTM,ModifiedAA,ModifiedPosition,PeptideUniqueToGene,ExperimentDesc,ExpID,PubmedID,ScoreType,IdentScore,LocProb,Log2FChange,PQ-val,QuantSig,PEP,MassErrorPPM
MPSLMLSDKK,ph,S,3,true,"Tissue atlas Arabidopsis - ProteomicsDB",114,32188942,"MaxQuant score",110.8800000,1.0000000,,,,0.0018592700362206,
PSLMLSDKKEEK,ph,S,7,true,"Tissue atlas Arabidopsis - ProteomicsDB",114,32188942,"MaxQuant score",141.0000000,1.0000000,,,,1.9922399587813E-6,
MALDTPELDSK,ph,T,23,true,"Tissue atlas Arabidopsis - ProteomicsDB",114,32188942,"MaxQuant score",173.1900000,1.0000000,,,,7.3079398435483E-12,
MALDTPELDSK,ph,S,28,true,"Tissue atlas Arabidopsis - ProteomicsDB",114,32188942,"MaxQuant score",113.5200000,0.9793820,,,,3.0999399314169E-5,
LKLSDSDEEESEKK,ph,S,40,true,"srk2dei ABA signaling phopshoproteomics",83,23572148,"MASCOT Score",21.0000000,,,,,,0.0014000
LKLSDSDEEESEKK,ph,S,40,true,"SnRK2 protein kinase substrates",85,23776212,XCorr,2.1464455,0.8290000,,,,0.078729197382927,
LKLSDSDEEESEKK,ph,S,40,true,"TOR Kinase and ABA Receptor",100,29290610,XCorr,2.3874907,0.8687000,,,,0.057020001113415,
LKLSDSDEEESEKK,ph,S,40,true,"Phospho cell culture sucrose/TOR",109,30833711,,,1.0000000,,,,,
LKLSDSDEEESEKK,ph,S,40,true,"Tissue atlas Arabidopsis - ProteomicsDB",114,32188942,"MaxQuant score",273.7700000,1.0000000,,,,0,
LKLSDSDEEESEK,ph,S,40,true,"STN8 phosphoproteome",38,21768351,"MASCOT Score",62.7400000,,,,,,
LKLSDSDEEESEK,ph,S,40,true,"Tyrosine phosphorylation in Arabidopsis",59,18463617,"MASCOT Score",47.0000000,,,,,,-1.5116655
LKLSDSDEEESEK,ph,S,40,true,"Chloroplast kinase substrates",60,19376835,"MASCOT Score",60.5700000,,,,,,-1.4640200
LKLSDSDEEESEK,ph,S,40,true,"srk2dei ABA signaling phopshoproteomics",83,23572148,"MASCOT Score",53.0000000,,,,,,-0.0015000
LKLSDSDEEESEK,ph,S,40,true,"LAXIC - mannitol vs control",84b,23660473,XCorr,4.7200000,1.0000000,,,,1.0699999620556E-5,
LKLSDSDEEESEK,ph,S,40,true,"SnRK2 protein kinase substrates",85,23776212,XCorr,4.7399087,1.0000000,,,,0.0004020550113637,
LKLSDSDEEESEK,ph,S,40,true,"atm and atr DNA damage response",88,25561503,"MASCOT Score",49.0000000,1.0000000,,,,,3.6300000
LKLSDSDEEESEK,ph,S,40,true,"Brassinosteroid-Regulated Phosphorylation Dynamics",94,26187819,"MaxQuant Score",188.0400000,1.0000000,,,,2.6969390244395E-41,1.9810000
LKLSDSDEEESEK,ph,S,40,true,"TOR Kinase and ABA Receptor",100,29290610,XCorr,4.9585557,1.0000000,,,,5.9539997891989E-6,
LKLSDSDEEESEKK,ph,S,42,true,"Arabidopsis root NAA phosphoproteome",18a,27643528,"MaxQuant Score",101.9200000,0.9990000,,,,6.1170002396693E-10,0.5120000
LKLSDSDEEESEKK,ph,S,42,true,"srk2dei ABA signaling phopshoproteomics",83,23572148,"MASCOT Score",21.0000000,,,,,,0.0014000
LKLSDSDEEESEKK,ph,S,42,true,"TOR Kinase and ABA Receptor",100,29290610,XCorr,2.3874907,0.8687000,,,,0.057020001113415,
LKLSDSDEEESEK,ph,S,42,true,"STN8 phosphoproteome",38,21768351,"MASCOT Score",47.3300000,,,,,,-0.7016440
LKLSDSDEEESEK,ph,S,42,true,"Tyrosine phosphorylation in Arabidopsis",59,18463617,"MASCOT Score",57.0000000,,,,,,-1.0077765
LKLSDSDEEESEK,ph,S,42,true,"Chloroplast kinase substrates",60,19376835,"MASCOT Score",60.5700000,,,,,,-1.4640200
LKLSDSDEEESEK,ph,S,42,true,"srk2dei ABA signaling phopshoproteomics",83,23572148,"MASCOT Score",53.0000000,,,,,,-0.0015000
LKLSDSDEEESEK,ph,S,42,true,"LAXIC - mannitol vs control",84b,23660473,XCorr,4.7200000,1.0000000,,,,1.0699999620556E-5,
LKLSDSDEEESEK,ph,S,42,true,"SnRK2 protein kinase substrates",85,23776212,XCorr,3.0242939,1.0000000,,,,0.0003258119977545,
LKLSDSDEEESEK,ph,S,42,true,"atm and atr DNA damage response",88,25561503,"MASCOT Score",64.0000000,1.0000000,,,,,-0.0500000
LKLSDSDEEESEK,ph,S,42,true,"Brassinosteroid-Regulated Phosphorylation Dynamics",94,26187819,"MaxQuant Score",188.0400000,1.0000000,,,,2.6969390244395E-41,1.9810000
LKLSDSDEEESEK,ph,S,42,true,"TOR Kinase and ABA Receptor",100,29290610,XCorr,4.9585557,1.0000000,,,,5.9539997891989E-6,
LSDSDEEESEKKK,ph,S,42,true,"atm and atr DNA damage response",88,25561503,"MASCOT Score",23.0000000,0.9930000,,,,,-0.7500000
LSDSDEEESEKK,ph,S,42,true,"SnRK2 protein kinase substrates",85,23776212,XCorr,2.5868738,0.9660000,,,,0.026263799518347,
LSDSDEEESEKK,ph,S,42,true,"Tissue atlas Arabidopsis - ProteomicsDB",114,32188942,"MaxQuant score",317.0300000,1.0000000,,,,0,
LSDSDEEESEK,ph,S,42,true,"Large-scale phosphorylation discovery",44,23111157,XCorr,3.8400000,,,,,,
LSDSDEEESEK,ph,S,42,true,"Chloroplast kinase substrates",60,19376835,"MASCOT Score",55.5400000,,,,,,-0.6840110
LSDSDEEESEK,ph,S,42,true,"LAXIC - mannitol vs control",84b,23660473,XCorr,3.7600000,1.0000000,-1.6993771,,NO,2.6599999980448E-10,
LSDSDEEESEK,ph,S,42,true,"SnRK2 protein kinase substrates",85,23776212,XCorr,3.3637347,1.0000000,,,,6.9833898663774E-9,
LSDSDEEESEK,ph,S,42,true,"atm and atr DNA damage response",88,25561503,"MASCOT Score",71.0000000,1.0000000,,,,,-0.2600000
LSDSDEEESEK,ph,S,42,true,"TOR Kinase and ABA Receptor",100,29290610,XCorr,4.1158695,0.9999000,,,,3.567000021576E-6,
LSDSDEEESEKKK,ph,S,47,true,"atm and atr DNA damage response",88,25561503,"MASCOT Score",23.0000000,1.0000000,,,,,-0.7500000
LSDSDEEESEKKK,ph,S,47,true,"Tissue atlas Arabidopsis - ProteomicsDB",114,32188942,"MaxQuant score",279.2700000,1.0000000,,,,0,
LKLSDSDEEESEK,ph,S,47,true,"Brassinosteroid-Regulated Phosphorylation Dynamics",94,26187819,"MaxQuant Score",122.9400000,0.8290000,,,,0.0020000000949949,1.3760000
LKLSDSDEEESEK,ph,S,47,true,"TOR Kinase and ABA Receptor",100,29290610,XCorr,4.2083702,1.0000000,,,,0.00035620000562631,
RKASEEEDEVK,ph,S,62,true,"TOR Kinase and ABA Receptor",100,29290610,XCorr,3.0430765,1.0000000,,,,0.0087540000677109,
KASEEEDEVK,ph,S,62,true,"Tissue atlas Arabidopsis - ProteomicsDB",114,32188942,"MaxQuant score",138.2400000,1.0000000,,,,7.6820097092423E-6,
ASEEEDEVKSDSSSEK,ph,S,70,true,"Large-scale phosphorylation discovery",44,23111157,XCorr,4.0540000,,,,,,
ASEEEDEVKSDSSSEK,ph,S,70,true,"SnRK2 protein kinase substrates",85,23776212,XCorr,3.9024057,1.0000000,,,,0.00021047100017313,
ASEEEDEVKSDSSSEK,ph,S,70,true,"TOR Kinase and ABA Receptor",100,29290610,XCorr,4.2384319,0.9978000,,,,0.00033939999411814,
ASEEEDEVKSDSSSEK,ph,S,70,true,"Tissue atlas Arabidopsis - ProteomicsDB",114,32188942,"MaxQuant score",216.3500000,0.9998190,,,,0,
KASEEEDEVKSDSSSEK,ph,S,72,true,"Tissue atlas Arabidopsis - ProteomicsDB",114,32188942,"MaxQuant score",167.9000000,0.9046860,,,,8.063029874825E-19,
ASEEEDEVKSDSSSEKK,ph,S,73,true,"Tissue atlas Arabidopsis - ProteomicsDB",114,32188942,"MaxQuant score",145.5400000,0.8732690,,,,2.8230401110036E-16,
GVDIVVGTPGR,ph,T,231,true,"Tissue atlas Arabidopsis - ProteomicsDB",114,32188942,"MaxQuant score",110.5100000,1.0000000,,,,9.2410897195805E-5,
HIAIPCNK,ox,C,331,true,"SPEAR - 10 mM H2O2 / mock",138a,34619326,,,,2.2286319,0.0474494,YES,,
HIAIPCNK,ox,C,331,true,"SPEAR - 50 mM H2O2 / mock",138b,34619326,,,,2.1340140,0.0482838,YES,,
QVCDSVVPAFLEAAK,sno,C,495,true,"hot5-4 / wildtype, FAT-switch S-nitrosoproteome",169,37277371,,,,1.3425237,0.0012357,YES,,
