Peptide,PTM,ModifiedAA,ModifiedPosition,PeptideUniqueToGene,ExperimentDesc,ExpID,PubmedID,ScoreType,IdentScore,LocProb,Log2FChange,PQ-val,QuantSig,PEP,MassErrorPPM
RWSFTTR,ph,S,27,true,"Tissue atlas Arabidopsis - ProteomicsDB",114,32188942,"MaxQuant score",86.1800000,0.9985530,,,,0.015944899991155,
NVGGGGNSSVFQIGR,ph,S,101,true,"Tissue atlas Arabidopsis - ProteomicsDB",114,32188942,"MaxQuant score",99.6630000,0.8701670,,,,2.3267799406312E-5,
CVSNAEVSSLDHR,ph,S,213,true,"atm and atr DNA damage response",88,25561503,"MASCOT Score",78.0000000,1.0000000,,,,,-0.3000000
CVSNAEVSSLDHR,ph,S,213,true,"Tissue atlas Arabidopsis - ProteomicsDB",114,32188942,"MaxQuant score",132.1500000,1.0000000,,,,1.4966600247135E-5,
CVSNAEVSSLDHR,ph,S,219,true,"Tissue atlas Arabidopsis - ProteomicsDB",114,32188942,"MaxQuant score",69.3790000,0.9041240,,,,0.00076320901280269,
LDWQAEESENGDK,ph,S,236,true,"Tissue atlas Arabidopsis - ProteomicsDB",114,32188942,"MaxQuant score",82.9250000,1.0000000,,,,0.00064477097475901,
QQSLLGPR,ph,S,272,true,"atm and atr DNA damage response",88,25561503,"MASCOT Score",45.0000000,1.0000000,,,,,-0.7800000
QQSLLGPR,ph,S,272,true,"Tissue atlas Arabidopsis - ProteomicsDB",114,32188942,"MaxQuant score",78.0600000,1.0000000,,,,0.01005269959569,
STENSPQVGSSGSR,ph,S,278,true,"atm and atr DNA damage response",88,25561503,"MASCOT Score",78.0000000,0.9470000,,,,,1.2000000
STENSPQVGSSGSR,ph,T,279,true,"atm and atr DNA damage response",88,25561503,"MASCOT Score",34.0000000,1.0000000,,,,,-0.3500000
STENSPQVGSSGSR,ph,T,279,true,"Tissue atlas Arabidopsis - ProteomicsDB",114,32188942,"MaxQuant score",128.2800000,0.7734320,,,,3.7450801755767E-5,
STENSPQVGSSGSR,ph,S,282,true,"atm and atr DNA damage response",88,25561503,"MASCOT Score",41.0000000,0.9350000,,,,,0.3400000
STENSPQVGSSGSR,ph,S,282,true,"Tissue atlas Arabidopsis - ProteomicsDB",114,32188942,"MaxQuant score",128.2800000,1.0000000,,,,0.0002206929930253,
STENSPQVGSSGSR,ph,S,287,true,"atm and atr DNA damage response",88,25561503,"MASCOT Score",57.0000000,0.9960000,,,,,-0.3800000
TPFTPTSR,ph,T,297,true,"TOR Kinase and ABA Receptor",100,29290610,XCorr,2.5901628,0.8716000,,,,0.0024810000322759,
