Peptide,PTM,ModifiedAA,ModifiedPosition,PeptideUniqueToGene,ExperimentDesc,ExpID,PubmedID,ScoreType,IdentScore,LocProb,Log2FChange,PQ-val,QuantSig,PEP,MassErrorPPM
ASSEVSMKGNRGG,nta,A,2,true,"Arabidopsis translation initiation landscape - NTA",167a,35069635,,,,,,,,
ASSEVSMKGNR,nta,A,2,true,"Arg/N-end rule pathway Roots",80,25728785,"MASCOT Score",29.3900000,,,,,0.045389998704195,
ASSEVSMKGNR,ph,S,7,true,"Tissue atlas Arabidopsis - ProteomicsDB",114,32188942,"MaxQuant score",59.9750000,0.9927010,,,,0.001768650021404,
GGDNFSSSGFSDPK,ph,S,18,true,"Tissue atlas Arabidopsis - ProteomicsDB",114,32188942,"MaxQuant score",153.2300000,0.9940390,,,,6.0386398104129E-8,
GGDNFSSSGFSDPK,ph,S,19,true,"Tissue atlas Arabidopsis - ProteomicsDB",114,32188942,"MaxQuant score",122.7500000,0.7530240,,,,3.7838501157239E-5,
GGDNFSSSGFSDPKETR,ph,S,23,true,"Tissue atlas Arabidopsis - ProteomicsDB",114,32188942,"MaxQuant score",113.4200000,0.9920980,,,,1.4438999995647E-9,
VEPALAPPALSPVPMPRPK,ph,S,402,true,"Tissue atlas Arabidopsis - ProteomicsDB",114,32188942,"MaxQuant score",157.5400000,1.0000000,,,,2.8280100768216E-16,
SNIAPSSPDSSMLTR,ph,S,414,true,"Tissue atlas Arabidopsis - ProteomicsDB",114,32188942,"MaxQuant score",60.2090000,0.9862470,,,,0.0014499799581245,
SNIAPSSPDSSMLTR,ph,S,419,true,"TOR Kinase and ABA Receptor",100,29290610,XCorr,2.7976127,0.9209000,,,,0.0023660000879318,
SNIAPSSPDSSMLTR,ph,S,420,true,"atm and atr DNA damage response",88,25561503,"MASCOT Score",36.0000000,0.9960000,,,,,-0.1800000
SNIAPSSPDSSMLTR,ph,S,420,true,"Phospho cell culture sucrose/TOR",109,30833711,,,0.9846890,,,,,
SNIAPSSPDSSMLTR,ph,S,420,true,"Tissue atlas Arabidopsis - ProteomicsDB",114,32188942,"MaxQuant score",174.3900000,0.9965610,,,,1.0980699588525E-18,
SNIAPSSPDSSMLTR,ph,S,423,true,"Conserved plant phosphoproteome - Arabidopsis",61a,20466843,"MASCOT Score",23.0000000,1.0000000,,,,,
ANMDPLPASGLSR,ph,S,442,true,"Tissue atlas Arabidopsis - ProteomicsDB",114,32188942,"MaxQuant score",114.5000000,0.8971680,,,,9.7782198281493E-5,
VLQGQEYSTLR,ph,S,454,true,"Tissue atlas Arabidopsis - ProteomicsDB",114,32188942,"MaxQuant score",141.1300000,0.8578460,,,,4.422529968906E-7,
IPFYDHSSSPSMPAK,ph,S,533,true,"Large-scale phosphorylation discovery",44,23111157,XCorr,2.6390000,,,,,,
IPFYDHSSSPSMPAK,ph,S,535,true,"Tissue atlas Arabidopsis - ProteomicsDB",114,32188942,"MaxQuant score",228.1100000,0.9710720,,,,0,
LHESPKVPAATDASLQGR,ph,S,572,true,"Tissue atlas Arabidopsis - ProteomicsDB",114,32188942,"MaxQuant score",232.0200000,1.0000000,,,,0,
QPFTIQEETAKSR,ph,T,646,true,"Tissue atlas Arabidopsis - ProteomicsDB",114,32188942,"MaxQuant score",65.4770000,0.7751720,,,,0.0021720500662923,
NNLNDAAGLTQIASPK,ph,S,689,true,"srk2dei ABA signaling phopshoproteomics",83,23572148,"MASCOT Score",71.0000000,,,,,,-0.0007000
NNLNDAAGLTQIASPK,ph,S,689,true,"atm and atr DNA damage response",88,25561503,"MASCOT Score",48.0000000,1.0000000,,,,,-0.9800000
NNLNDAAGLTQIASPK,ph,S,689,true,"TOR Kinase and ABA Receptor",100,29290610,XCorr,5.3680358,1.0000000,,,,4.4460000125923E-9,
NNLNDAAGLTQIASPK,ph,S,689,true,"Lateral root-induction - NAA vs control",106,23328941,"MASCOT Score",39.0000000,,,,,,
NNLNDAAGLTQIASPK,ph,S,689,true,"Phospho cell culture sucrose/TOR",109,30833711,,,0.9993890,,,,,
NNLNDAAGLTQIASPK,ph,S,689,true,"Col-0 callus - FC Col-0 vs. Col-0 Xray",111a,31410901,,82.7200000,,0.8588940,0.0000000,NO,,1.4985444
NNLNDAAGLTQIASPK,ph,S,689,true,"Col-0 X-ray callus - FC Col-0 vs. Col-0 Xray",111b,31410901,,82.7200000,,0.8588940,0.0000000,NO,,1.4985444
NNLNDAAGLTQIASPK,ph,S,689,true,"atm callus - FC atm vs. atm Xray",111c,31410901,,82.7200000,,1.6687067,0.0000000,NO,,1.4985444
NNLNDAAGLTQIASPK,ph,S,689,true,"atm-3 X-ray callus - FC atm vs. atm Xray",111d,31410901,,82.7200000,,1.6687067,0.0000000,NO,,1.4985444
NNLNDAAGLTQIASPK,ph,S,689,true,"Tissue atlas Arabidopsis - ProteomicsDB",114,32188942,"MaxQuant score",311.9200000,1.0000000,,,,0,
NNLNDAAGLTQIASPK,ph,S,689,true,"Touch-induced phosphorylation: 40s touch vs untouc",136,30291188,"MASCOT score",88.7100000,,-0.1177169,0.7916245,NO,,9.0111418
MNPGTLSCRSEEEAVVGEGSDAK,ph,S,827,true,"Conserved plant phosphoproteome - Arabidopsis",61a,20466843,"MASCOT Score",29.0000000,1.0000000,,,,,
SEEEAVVGEGSDAKDAK,ph,S,830,true,"Tissue atlas Arabidopsis - ProteomicsDB",114,32188942,"MaxQuant score",168.5900000,1.0000000,,,,1.4012984643248E-45,
SEEEAVVGEGSDAKDAK,ph,S,840,true,"Tissue atlas Arabidopsis - ProteomicsDB",114,32188942,"MaxQuant score",273.4300000,1.0000000,,,,0,
SEEEAVVGEGSDAK,ph,S,840,true,"Tyrosine phosphorylation in Arabidopsis",59,18463617,"MASCOT Score",27.0000000,,,,,,-0.4711944
MNPGTLSCRSEEEAVVGEGSDAKDAK,sumo,K,843,true,"SUMO Ligase SIZ1 heat stress",4,29588388,,,,,,,,
SASNPSLSSAGNS,ph,S,852,true,"atm and atr DNA damage response",88,25561503,"MASCOT Score",44.0000000,0.8280000,,,,,-0.5100000
SASNPSLSSAGNS,ph,S,855,true,"atm and atr DNA damage response",88,25561503,"MASCOT Score",26.0000000,0.8640000,,,,,-0.1600000
