Peptide,PTM,ModifiedAA,ModifiedPosition,PeptideUniqueToGene,ExperimentDesc,ExpID,PubmedID,ScoreType,IdentScore,LocProb,Log2FChange,PQ-val,QuantSig,PEP,MassErrorPPM
FSSDSHSGTVSSTSSHQFSSTPLLFQR,fuc,S,183,true,"SPINDLY O-fucosylation",162,36739885,,,,,,,0.31000000238419,
FSSDSHSGTVSSTSSHQFSSTPLLFQR,fuc,T,187,true,"SPINDLY O-fucosylation",162,36739885,,,,,,,-1.3999999761581,
AGSLDVDESK,ph,S,237,true,"atm and atr DNA damage response",88,25561503,"MASCOT Score",65.0000000,1.0000000,,,,,-1.4600000
AGSLDVDESK,ph,S,237,true,"Phospho cell culture sucrose/TOR",109,30833711,,,0.9999880,,,,,
AGSLDVDESK,ph,S,237,true,"Tissue atlas Arabidopsis - ProteomicsDB",114,32188942,"MaxQuant score",110.4400000,1.0000000,,,,0.00022100300702732,
TSSSGIGYGGSDISSWR,ph,S,255,true,"Phosphorylation Early Elicitor Signaling",23,17317660,,,,,,,,
TSSSGIGYGGSDISSWR,ph,S,255,true,"srk2dei ABA signaling phopshoproteomics",83,23572148,"MASCOT Score",64.0000000,,,,,,0.0011000
TSSSGIGYGGSDISSWR,ph,S,255,true,"TOR Kinase and ABA Receptor",100,29290610,XCorr,4.1397529,0.8252000,,,,1.8289999559329E-7,
TSSSGIGYGGSDISSWR,ph,S,256,true,"srk2dei ABA signaling phopshoproteomics",83,23572148,"MASCOT Score",81.0000000,,,,,,0.0018000
TSSSGIGYGGSDISSWR,ph,S,256,true,"Phospho cell culture sucrose/TOR",109,30833711,,,0.9642430,,,,,
TSSSGIGYGGSDISSWR,ph,S,256,true,"Tissue atlas Arabidopsis - ProteomicsDB",114,32188942,"MaxQuant score",186.7000000,0.9957000,,,,3.5137399413876E-30,
SSQMEEASSSSTYSDPTSSSSQIHK,ph,S,284,true,"Tissue atlas Arabidopsis - ProteomicsDB",114,32188942,"MaxQuant score",270.1400000,0.9776290,,,,0,
