Peptide,PTM,ModifiedAA,ModifiedPosition,PeptideUniqueToGene,ExperimentDesc,ExpID,PubmedID,ScoreType,IdentScore,LocProb,Log2FChange,PQ-val,QuantSig,PEP,MassErrorPPM
SSRVDRFSKSDIIVSPSILSAN,nt,S,47,true,"HUNTER N-terminome: legumain, GluC and trypsin",119,31951383,"MaxQuant score",142.9800000,,,,,,
SDIIVSPSILSANFAKLGEQVK,ac,K,71,true,"Histone deacetylases - apicidin vs control",98a,29061669,"MaxQuant Score",67.8000000,1.0000000,0.1390000,0.5623413,NO,4.9000001105248E-12,
SDIIVSPSILSANFAKLGEQVK,ac,K,71,true,"Histone deacetylases substrates - TSA vs control",98b,29061669,"MaxQuant Score",67.8000000,1.0000000,-0.4530000,0.9977001,NO,4.9000001105248E-12,
AVELAGCDWIHVDVMDGR,ox,C,84,true,"SPEAR - 10 mM H2O2 / mock",138a,34619326,,,,1.3661131,0.0070644,YES,,
AGADIVSVHCEQQSTIHLHR,sno,C,146,true,"Site-specific nitrosomeproteomic id - gsnor1-3",90a,25699590,XCorr,3.0616255,,,,,0.21930000185966,-6.2485204
AGADIVSVHCEQQSTIHLHR,sno,C,146,true,"Site-specific nitrosomeproteomic id - gsnor1-3",90b,25699590,XCorr,3.4826205,,,,,0.032990001142025,-5.2819941
TVNQIKSLGAK,ac,K,162,true,"Histone deacetylases substrates - TSA vs control",98b,29061669,"MaxQuant Score",67.5000000,1.0000000,-0.0530000,0.9977001,NO,0.0010000000474975,
TVNQIKSLGAK,ac,K,162,true,"Quantitative Acetylproteomics",101,29440448,,,,,,,,
SVNPGFGGQSFIE,nt,S,195,true,"Arg/N-end rule seed, prt6 vs. Wt",99,29168982,"MASCOT Score",53.6800000,,-0.2554818,0.2515450,NO,0.00015029999485705,-2.4887205
DYAEAIKGIK,ac,K,268,true,"Histone deacetylases substrates - TSA vs control",98b,29061669,"MaxQuant Score",102.5000000,1.0000000,0.2820000,0.9772372,NO,0.0004600000102073,
