Peptide,PTM,ModifiedAA,ModifiedPosition,PeptideUniqueToGene,ExperimentDesc,ExpID,PubmedID,ScoreType,IdentScore,LocProb,Log2FChange,PQ-val,QuantSig,PEP,MassErrorPPM
KSPANLPK,ph,S,7,true,"STN8 phosphoproteome",38,21768351,"MASCOT Score",44.2500000,,,,,,0.0594534
KSPANLPK,ph,S,7,true,"atm and atr DNA damage response",88,25561503,"MASCOT Score",40.0000000,1.0000000,,,,,-1.6300000
SPANLPK,ph,S,7,true,"Tissue atlas Arabidopsis - ProteomicsDB",114,32188942,"MaxQuant score",70.6750000,1.0000000,,,,0.01052560005337,
HNSVDLK,ph,S,16,true,"STN8 phosphoproteome",38,21768351,"MASCOT Score",50.4100000,,,,,,-0.0452008
HNSVDLK,ph,S,16,true,"Chloroplast kinase substrates",60,19376835,"MASCOT Score",38.8500000,,,,,,-0.7167930
HNSVDLK,ph,S,16,true,"LAXIC - mannitol vs control",84b,23660473,XCorr,2.2100000,1.0000000,,,,0.020994300022721,
HNSVDLK,ph,S,16,true,"TOR Kinase and ABA Receptor",100,29290610,XCorr,2.5272439,1.0000000,,,,0.0076950001530349,
HNSVDLK,ph,S,16,true,"Phospho cell culture sucrose/TOR",109,30833711,,,1.0000000,,,,,
SSKPNPFDSDDESDNKHTLNPSKR,ph,S,29,true,"Phosphoproteome ethylene-regulated time response",46,24043427,"MASCOT Score",129.4800000,,,,,,-23.1732000
SSKPNPFDSDDESDNKHTLNPSKR,ph,S,29,true,"Chloroplast kinase substrates",60,19376835,"MASCOT Score",53.4500000,,,,,,-0.2685410
SSKPNPFDSDDESDNKHTLNPSKR,ph,S,29,true,"LAXIC - mannitol vs control",84b,23660473,XCorr,2.9600000,0.7990000,,,,1.4900000451235E-6,
SSKPNPFDSDDESDNKHTLNPSKR,ph,S,29,true,"SnRK2 protein kinase substrates",85,23776212,XCorr,3.9021177,0.9960000,,,,5.4947000183332E-14,
SSKPNPFDSDDESDNKHTLNPSK,ph,S,29,true,"STN8 phosphoproteome",38,21768351,"MASCOT Score",53.5400000,,,,,,-0.5080890
SSKPNPFDSDDESDNKHTLNPSK,ph,S,29,true,"SnRK2 protein kinase substrates",85,23776212,XCorr,3.3904150,0.9930000,,,,0.00015780499961693,
SSKPNPFDSDDESDNK,ph,S,29,true,"Phosphorylation Early Elicitor Signaling",23,17317660,,,,,,,,
SSKPNPFDSDDESDNK,ph,S,29,true,"STN8 phosphoproteome",38,21768351,"MASCOT Score",88.0100000,,,,,,-1.2414000
SSKPNPFDSDDESDNK,ph,S,29,true,"Tyrosine phosphorylation in Arabidopsis",59,18463617,"MASCOT Score",54.0000000,,,,,,-1.5585514
SSKPNPFDSDDESDNK,ph,S,29,true,"Chloroplast kinase substrates",60,19376835,"MASCOT Score",80.2800000,,,,,,-0.9085550
SSKPNPFDSDDESDNK,ph,S,29,true,"srk2dei ABA signaling phopshoproteomics",83,23572148,"MASCOT Score",81.0000000,,,,,,-0.0009000
SSKPNPFDSDDESDNK,ph,S,29,true,"LAXIC - mannitol vs control",84b,23660473,XCorr,4.0500000,1.0000000,,,,0.009423409588635,
SSKPNPFDSDDESDNK,ph,S,29,true,"SnRK2 protein kinase substrates",85,23776212,XCorr,3.5364592,1.0000000,,,,0.0073668998666108,
SSKPNPFDSDDESDNK,ph,S,29,true,"atm and atr DNA damage response",88,25561503,"MASCOT Score",49.0000000,1.0000000,,,,,-0.6100000
SSKPNPFDSDDESDNK,ph,S,29,true,"Brassinosteroid-Regulated Phosphorylation Dynamics",94,26187819,"MaxQuant Score",205.6800000,1.0000000,,,,9.955945329335E-41,1.3280000
SSKPNPFDSDDESDNK,ph,S,29,true,"TOR Kinase and ABA Receptor",100,29290610,XCorr,6.1412735,1.0000000,,,,7.8899997646431E-10,
SSKPNPFDSDDESDNK,ph,S,29,true,"Lateral root-induction - NAA vs control",106,23328941,"MASCOT Score",60.0000000,,,,,,
SSKPNPFDSDDESDNK,ph,S,29,true,"Phospho cell culture sucrose/TOR",109,30833711,,,1.0000000,,,,,
SSKPNPFDSDDESDNK,ph,S,29,true,"Col-0 callus - FC Col-0 vs. Col-0 Xray",111a,31410901,,58.0000000,,0.2993122,0.0000000,NO,,1.0141971
SSKPNPFDSDDESDNK,ph,S,29,true,"Col-0 X-ray callus - FC Col-0 vs. Col-0 Xray",111b,31410901,,58.0000000,,0.2993122,0.0000000,NO,,1.0141971
SSKPNPFDSDDESDNK,ph,S,29,true,"atm callus - FC atm vs. atm Xray",111c,31410901,,58.0000000,,-0.0668186,0.0000000,NO,,1.0141971
SSKPNPFDSDDESDNK,ph,S,29,true,"atm-3 X-ray callus - FC atm vs. atm Xray",111d,31410901,,58.0000000,,-0.0668186,0.0000000,NO,,1.0141971
SSKPNPFDSDDESDNK,ph,S,29,true,"Tissue atlas Arabidopsis - ProteomicsDB",114,32188942,"MaxQuant score",314.0000000,1.0000000,,,,0,
SSKPNPFDSDDESDNK,ph,S,33,true,"srk2dei ABA signaling phopshoproteomics",83,23572148,"MASCOT Score",20.0000000,,,,,,-0.0014000
SSKPNPFDSDDESDNK,ph,S,33,true,"Lateral root-induction - NAA vs control",106,23328941,"MASCOT Score",29.0000000,,,,,,
TTSEPSLADMTNPFGGER,ph,T,45,true,"MAPK Arabidopsis substrates",45,23172892,"MaxQuant Score",124.9200000,,,,,,
TTSEPSLADMTNPFGGER,ph,T,45,true,"srk2dei ABA signaling phopshoproteomics",83,23572148,"MASCOT Score",34.0000000,,,,,,-0.0015000
TTSEPSLADMTNPFGGER,ph,T,45,true,"SnRK2 protein kinase substrates",85,23776212,XCorr,2.5341225,0.8230000,,,,3.2474498784518E-11,
TTSEPSLADMTNPFGGER,ph,T,45,true,"Lateral root-induction - NAA vs control",106,23328941,"MASCOT Score",85.0000000,,,,,,
RTTSEPSLADMTNPFGGER,ph,T,46,true,"srk2dei ABA signaling phopshoproteomics",83,23572148,"MASCOT Score",73.0000000,,,,,,0.0015000
TTSEPSLADMTNPFGGER,ph,T,46,true,"ABA-induced protein phosphorylation",35,20733066,,,,,,,,
TTSEPSLADMTNPFGGER,ph,T,46,true,"MAPK Arabidopsis substrates",45,23172892,"MaxQuant Score",120.6600000,,,,,,
TTSEPSLADMTNPFGGER,ph,T,46,true,"Lateral root-induction - NAA vs control",106,23328941,"MASCOT Score",65.0000000,,,,,,
RTTSEPSLADMTNPFGGER,ph,S,47,true,"srk2dei ABA signaling phopshoproteomics",83,23572148,"MASCOT Score",67.0000000,,,,,,-0.0015000
TTSEPSLADMTNPFGGER,ph,S,47,true,"PAMP-triggered phosphorylation",48,24601666,"MASCOT Score",66.5500000,,,,,,
TTSEPSLADMTNPFGGER,ph,S,47,true,"srk2dei ABA signaling phopshoproteomics",83,23572148,"MASCOT Score",79.0000000,,,,,,-0.0001000
TTSEPSLADMTNPFGGER,ph,S,47,true,"LAXIC - ABA stress",84a,23660473,XCorr,4.8000000,0.8660000,,,,1.9999999920084E-11,
TTSEPSLADMTNPFGGER,ph,S,47,true,"LAXIC - mannitol vs control",84b,23660473,XCorr,4.3100000,0.8300000,1.1659321,,NO,3.7099998735357E-5,
TTSEPSLADMTNPFGGER,ph,S,47,true,"SnRK2 protein kinase substrates",85,23776212,XCorr,3.7962959,0.8670000,,,,5.8314398299866E-15,
TTSEPSLADMTNPFGGER,ph,S,47,true,"atm and atr DNA damage response",88,25561503,"MASCOT Score",57.0000000,0.9510000,,,,,-0.2100000
TTSEPSLADMTNPFGGER,ph,S,47,true,"Lateral root-induction - NAA vs control",106,23328941,"MASCOT Score",65.0000000,,,,,,
TTSEPSLADMTNPFGGER,ph,S,47,true,"Phospho cell culture sucrose/TOR",109,30833711,,,0.9965550,,,,,
TTSEPSLADMTNPFGGER,ph,S,47,true,"Col-0 callus - FC Col-0 vs. Col-0 Xray",111a,31410901,,86.1700000,,0.9989874,0.0000000,NO,,1.5903043
TTSEPSLADMTNPFGGER,ph,S,47,true,"Col-0 X-ray callus - FC Col-0 vs. Col-0 Xray",111b,31410901,,86.1700000,,0.9989874,0.0000000,NO,,1.5903043
TTSEPSLADMTNPFGGER,ph,S,47,true,"atm callus - FC atm vs. atm Xray",111c,31410901,,86.1700000,,2.1722497,0.0000000,NO,,1.5903043
TTSEPSLADMTNPFGGER,ph,S,47,true,"atm-3 X-ray callus - FC atm vs. atm Xray",111d,31410901,,86.1700000,,2.1722497,0.0000000,NO,,1.5903043
TTSEPSLADMTNPFGGER,ph,S,47,true,"Tissue atlas Arabidopsis - ProteomicsDB",114,32188942,"MaxQuant score",267.6200000,0.9996480,,,,0,
RTTSEPSLADMTNPFGGER,ph,S,50,true,"srk2dei ABA signaling phopshoproteomics",83,23572148,"MASCOT Score",72.0000000,,,,,,-0.0005000
LLGSLGGMFSK,ph,S,167,true,"Tissue atlas Arabidopsis - ProteomicsDB",114,32188942,"MaxQuant score",50.3540000,0.9971900,,,,0.0083988402038813,
LLGSLGGMFSK,ph,S,173,true,"atm and atr DNA damage response",88,25561503,"MASCOT Score",61.0000000,1.0000000,,,,,-1.4100000
LLGSLGGMFSK,ph,S,173,true,"Tissue atlas Arabidopsis - ProteomicsDB",114,32188942,"MaxQuant score",70.6970000,0.9984930,,,,0.0008655019919388,
TRPINGPVVTRDDSPTR,ph,T,190,true,"srk2dei ABA signaling phopshoproteomics",83,23572148,"MASCOT Score",43.0000000,,,,,,-0.0008000
TRPINGPVVTRDDSPTR,ph,S,194,true,"srk2dei ABA signaling phopshoproteomics",83,23572148,"MASCOT Score",47.0000000,,,,,,-0.0004000
VNHLEKR,ub,K,204,true,"Arabidopsis ubiquitination COFRADIC",40,26744219,"MaxQuant Score",120.4600000,1.0000000,,,,0.0080000003799796,-0.2520000
EKLGLNSAPR,ub,K,207,true,"Arabidopsis ubiquitination COFRADIC",40,26744219,"MaxQuant Score",61.3440000,1.0000000,,,,0.0089999996125698,0.3330000
LGLNSAPR,ph,S,212,true,"Tissue atlas Arabidopsis - ProteomicsDB",114,32188942,"MaxQuant score",153.9700000,1.0000000,,,,0.001590030035004,
