Peptide,PTM,ModifiedAA,ModifiedPosition,PeptideUniqueToGene,ExperimentDesc,ExpID,PubmedID,ScoreType,IdentScore,LocProb,Log2FChange,PQ-val,QuantSig,PEP,MassErrorPPM
ANPDHVSDVLH,nt,A,2,true,"Arg/N-end rule seed, prt6 vs. Wt",99,29168982,"MASCOT Score",51.6600000,,,,,0.0056969998404384,-2.0767364
ANPDHVSDVLHNLSIDPTTKALAPDSE,nta,A,2,true,"HUNTER N-terminome: legumain, GluC and trypsin",119,31951383,"MaxQuant score",69.4440000,,,,,,
ANPDHVSDVLH,nta,A,2,true,"Arg/N-end rule seed, prt6 vs. Wt",99,29168982,"MASCOT Score",51.6600000,,,,,0.0056969998404384,-2.0767364
ANPDHVSDVLHNLSIDPTTK,ph,S,8,true,"Tissue atlas Arabidopsis - ProteomicsDB",114,32188942,"MaxQuant score",91.1000000,0.9999990,,,,4.1385200688637E-7,
KLGYQSAAYNAK,ub,K,76,true,"upl3 mutant / wildtype",168,35926874,"MaxQuant score",71.1760000,1.0000000,-0.9077926,0.2304800,NO,0.0049123200587928,0.7175200
DYNKIDFPETYTEAK,ph,Y,258,true,"Phosphorylation in N starvation",63,22060019,"MASCOT Score",99.0000000,,,,,,9.7573400
WIGCFPVK,so,C,348,false,"Arabidopsis S-sulfenylation chemoproteomics",108,31578252,"pFind PSM Score",0.2703610,,,,,,-0.9471143
INLVKPQESTTASEDAAALGVAAEVTK,ph,S,460,true,"Tissue atlas Arabidopsis - ProteomicsDB",114,32188942,"MaxQuant score",110.6700000,0.7684130,,,,4.1446200181383E-28,
